Methane, chlorofluoro-
- Formula: CH2ClF
- Molecular weight: 68.478
- IUPAC Standard InChIKey: XWCDCDSDNJVCLO-UHFFFAOYSA-N
- CAS Registry Number: 593-70-4
- Chemical structure:

Gas phase thermochemistry data

Quantity | Value | Units | Method | Reference | Comment |
---|---|---|---|---|---|
ΔfH°gas | -261.92 | kJ/mol | Review | Chase, 1998 | Data last reviewed in June, 1970 |
Quantity | Value | Units | Method | Reference | Comment |
S°gas,1 bar | 264.41 | J/mol*K | Review | Chase, 1998 | Data last reviewed in June, 1970 |
Gas Phase Heat Capacity (Shomate Equation)
Cp° = A + B*t + C*t2 + D*t3 +
E/t2
H° − H°298.15= A*t + B*t2/2 +
C*t3/3 + D*t4/4 − E/t + F − H
S° = A*ln(t) + B*t + C*t2/2 + D*t3/3 −
E/(2*t2) + G
Cp = heat capacity (J/mol*K)
H° = standard enthalpy (kJ/mol)
S° = standard entropy (J/mol*K)
t = temperature (K) / 1000.
View plot Requires a JavaScript / HTML 5 canvas capable browser.
Temperature (K) | 298. to 1200. | 1200. to 6000. |
---|---|---|
A | 6.818874 | 94.77095 |
B | 158.6351 | 6.914438 |
C | -110.1622 | -1.326024 |
D | 29.79627 | 0.088205 |
E | 0.168663 | -16.33768 |
F | -269.5241 | -326.8767 |
G | 230.9514 | 329.9950 |
H | -261.9184 | -261.9184 |
Reference | Chase, 1998 | Chase, 1998 |
Comment | Data last reviewed in June, 1970 | Data last reviewed in June, 1970 |

Phase change data

Data compiled as indicated in comments:
BS - Robert L. Brown and Stephen E. Stein
AC - William E. Acree, Jr., James S. Chickos
Quantity | Value | Units | Method | Reference | Comment |
---|---|---|---|---|---|
Tboil | 264.0 | K | N/A | PCR Inc., 1990 | BS |
Enthalpy of vaporization
ΔvapH (kJ/mol) | Temperature (K) | Method | Reference | Comment |
---|---|---|---|---|
23.3 | 249. | A | Stephenson and Malanowski, 1987 | Based on data from 140. to 264. K. See also Dykyj, 1970.; AC |

Reaction thermochemistry data

Data compiled by: John E. Bartmess
Individual Reactions
CHClF- + =
By formula: CHClF- + H+ = CH2ClF
Quantity | Value | Units | Method | Reference | Comment |
---|---|---|---|---|---|
ΔrH° | 1614.8 ± 4.0 | kJ/mol | G+TS | Poutsma, Paulino, et al., 1997 | gas phase; Relative to MeOH at ΔGacid=375.1 |
Quantity | Value | Units | Method | Reference | Comment |
ΔrG° | 1576.1 ± 1.3 | kJ/mol | IMRE | Poutsma, Paulino, et al., 1997 | gas phase; Relative to MeOH at ΔGacid=375.1 |

Henry's Law data

Data compiled by: Rolf Sander
Henry's Law constant (water solution)
kH(T) = k°H exp(d(ln(kH))/d(1/T) ((1/T) - 1/(298.15 K)))
k°H = Henry's law constant for solubility in water at 298.15 K (mol/(kg*bar))
d(ln(kH))/d(1/T) = Temperature dependence constant (K)
k°H (mol/(kg*bar)) | d(ln(kH))/d(1/T) (K) | Method | Reference | Comment |
---|---|---|---|---|
0.15 | Q | N/A | missing citation give several references for the Henry's law constants but don't assign them to specific species. | |
0.15 | 2600. | L | N/A | |
0.15 | V | N/A |

Gas phase ion energetics data

Data compiled as indicated in comments:
B - John E. Bartmess
LBLHLM - Sharon G. Lias, John E. Bartmess, Joel F. Liebman, John L. Holmes, Rhoda D. Levin, and W. Gary Mallard
LLK - Sharon G. Lias, Rhoda D. Levin, and Sherif A. Kafafi
Ionization energy determinations
IE (eV) | Method | Reference | Comment |
---|---|---|---|
11.74 | PE | Doucet, Sauvageau, et al., 1973 | LLK |
11.71 ± 0.01 | PE | Andrews, Dyke, et al., 1984 | Vertical value; LBLHLM |
De-protonation reactions
CHClF- + =
By formula: CHClF- + H+ = CH2ClF
Quantity | Value | Units | Method | Reference | Comment |
---|---|---|---|---|---|
ΔrH° | 1614.8 ± 4.0 | kJ/mol | G+TS | Poutsma, Paulino, et al., 1997 | gas phase; Relative to MeOH at ΔGacid=375.1; B |
Quantity | Value | Units | Method | Reference | Comment |
ΔrG° | 1576.1 ± 1.3 | kJ/mol | IMRE | Poutsma, Paulino, et al., 1997 | gas phase; Relative to MeOH at ΔGacid=375.1; B |

Normal alkane RI, non-polar column, temperature ramp

Column type | Active phase | I | Reference | Comment |
---|---|---|---|---|
Capillary | OV-101 | 374. | Zenkevich, 2005 | 25. m/0.20 mm/0.10 μm, N2/He, 6. K/min; Tstart: 50. C; Tend: 250. C |

References

Chase, 1998
Chase, M.W., Jr.,
NIST-JANAF Themochemical Tables, Fourth Edition,
J. Phys. Chem. Ref. Data, Monograph 9, 1998, 1-1951. [all data]
PCR Inc., 1990
PCR Inc.,
Research Chemicals Catalog 1990-1991, PCR Inc., Gainesville, FL, 1990, 1. [all data]
Stephenson and Malanowski, 1987
Stephenson, Richard M.; Malanowski, Stanislaw,
Handbook of the Thermodynamics of Organic Compounds, 1987, https://doi.org/10.1007/978-94-009-3173-2
. [all data]
Dykyj, 1970
Dykyj, J.,
Petrochemica, 1970, 10, 2, 51. [all data]
Poutsma, Paulino, et al., 1997
Poutsma, J.C.; Paulino, J.A.; Squires, R.R.,
Absolute Heats of Formation of CHCl, CHF, and CClF. A Gas-Phase Experimental and G2 Theoretical Study.,
J. Phys. Chem. A, 1997, 101, 29, 5327, https://doi.org/10.1021/jp970778f
. [all data]
Doucet, Sauvageau, et al., 1973
Doucet, J.; Sauvageau, P.; Sandorfy, C.,
Vacuum ultraviolet and photoelectron spectra of fluoro-chloro derivatives of methane,
J. Chem. Phys., 1973, 58, 3708. [all data]
Andrews, Dyke, et al., 1984
Andrews, L.; Dyke, J.M.; Jonathan, N.; Keddar, N.; Morris, A.,
Photoelectron spectroscopic study of the ground states of CH2Cl+, CHCl2+, and CHFCl+,
J. Am. Chem. Soc., 1984, 106, 299. [all data]
Zenkevich, 2005
Zenkevich, I.G.,
Experimentally measured retention indices., 2005. [all data]