vinylamine
- Formula: C2H5N
- Molecular weight: 43.0678
- IUPAC Standard InChIKey: UYMKPFRHYYNDTL-UHFFFAOYSA-N
- CAS Registry Number: 593-67-9
- Chemical structure:
View 3d structure (requires JavaScript / HTML 5) - Other names: Ethenamine

Gas phase ion energetics data

Data evaluated as indicated in comments:
HL - Edward P. Hunter and Sharon G. Lias
Data compiled as indicated in comments:
LL - Sharon G. Lias and Joel F. Liebman
LBLHLM - Sharon G. Lias, John E. Bartmess, Joel F. Liebman, John L. Holmes, Rhoda D. Levin, and W. Gary Mallard
Quantity | Value | Units | Method | Reference | Comment |
---|---|---|---|---|---|
Proton affinity (review) | 898.9 | kJ/mol | N/A | Hunter and Lias, 1998 | HL |
Quantity | Value | Units | Method | Reference | Comment |
Gas basicity | 866.5 | kJ/mol | N/A | Hunter and Lias, 1998 | HL |
Ionization energy determinations
IE (eV) | Method | Reference | Comment |
---|---|---|---|
8.10 | EST | Takhistov and Ponomarev, 1994 | LL |
8.20 | PE | Albercht, Allan, et al., 1984 | LBLHLM |
8.6 | PE | Gonbeau, Lacombe, et al., 1988 | Vertical value; LL |
8.65 | PE | Albercht, Allan, et al., 1984 | Vertical value; LBLHLM |

References

Hunter and Lias, 1998
Hunter, E.P.; Lias, S.G.,
Evaluated Gas Phase Basicities and Proton Affinities of Molecules: An Update,
J. Phys. Chem. Ref. Data, 1998, 27, 3, 413-656, https://doi.org/10.1063/1.556018
. [all data]
Takhistov and Ponomarev, 1994
Takhistov, V.V.; Ponomarev, D.A.,
Isodesmic reactions and thermochemistry of ions,
Org. Mass Spectrom., 1994, 29, 395. [all data]
Albercht, Allan, et al., 1984
Albercht, B.; Allan, M.; Haselbach, E.; Neuhaus, L.; Carrupt, P.-A.,
27. Molecular ions of transient species: Vinylamine-cation,
Helv. Chim. Acta, 1984, 67, 220. [all data]
Gonbeau, Lacombe, et al., 1988
Gonbeau, D.; Lacombe, S.; Lasnes, M.; Ripoll, J.; Pfister-Guillouzo, G.,
Ethenylphosphine. Synthesis by flash-vacuum thermolysis and characterization by photoelectron spectroscopy,
J. Am. Chem. Soc., 1988, 110, 2730. [all data]