Ethene, iodo-
- Formula: C2H3I
- Molecular weight: 153.9497
- IUPAC Standard InChIKey: GHXZPUGJZVBLGC-UHFFFAOYSA-N
- CAS Registry Number: 593-66-8
- Chemical structure:
View 3d structure (requires JavaScript / HTML 5) - Other names: Vinyl iodide; iodoethylene

Phase change data

Data compiled as indicated in comments:
BS - Robert L. Brown and Stephen E. Stein
TRC - Thermodynamics Research Center, NIST Boulder Laboratories, Chris Muzny director
Quantity | Value | Units | Method | Reference | Comment |
---|---|---|---|---|---|
Tboil | 329.2 | K | N/A | Weast and Grasselli, 1989 | BS |
Tboil | 330.15 | K | N/A | Katritzky, Pinzelli, et al., 1970 | Uncertainty assigned by TRC = 2. K; TRC |

Gas phase ion energetics data

Data compiled as indicated in comments:
LLK - Sharon G. Lias, Rhoda D. Levin, and Sherif A. Kafafi
Ionization energy determinations
IE (eV) | Method | Reference | Comment |
---|---|---|---|
9.32 | PE | Salahub and Boschi, 1974 | LLK |
9.33 | PE | Mines and Thompson, 1973 | LLK |
9.296 | S | Boschi and Salahub, 1972 | LLK |
9.35 | PE | Wittel, Bock, et al., 1974 | Vertical value; LLK |
9.32 | PE | Boschi and Salahub, 1974 | Vertical value; LLK |

References

Weast and Grasselli, 1989
CRC Handbook of Data on Organic Compounds, 2nd Editon, Weast,R.C and Grasselli, J.G., ed(s)., CRC Press, Inc., Boca Raton, FL, 1989, 1. [all data]
Katritzky, Pinzelli, et al., 1970
Katritzky, A.R.; Pinzelli, R.F.; Sinnot, M.V.; Topsom, R.D.,
Infrared INtensities as a Quantitative Measure of Intramoelcular Inter- actions XV. Monosubstituted Ethylenes,
J. Am. Chem. Soc., 1970, 92, 6861. [all data]
Salahub and Boschi, 1974
Salahub, D.R.; Boschi, R.A.,
A pot-pourri of UV and PE spectra of iodides,
Chem. Spectrosc. Photochem. Vac. Ultraviolet, Proc. Adv. Study Inst. 1973, 1974, 191. [all data]
Mines and Thompson, 1973
Mines, G.W.; Thompson, H.W.,
Photoelectron spectra of vinyl and allyl halides,
Spectrochim. Acta Part A, 1973, 29, 1377. [all data]
Boschi and Salahub, 1972
Boschi, R.A.; Salahub, D.R.,
The far ultra-violet spectra of some branched chain iodo-alkanes, iodo-cycloalkanes, fluoro-iodoalkanes and iodo-alkenes,
Mol. Phys., 1972, 24, 735. [all data]
Wittel, Bock, et al., 1974
Wittel, K.; Bock, H.; Manne, R.,
Photoelectron spectra of iodo ethylenes. A simple method to incorporate spin orbit coupling in molecular orbital models,
Tetrahedron, 1974, 30, 651. [all data]
Boschi and Salahub, 1974
Boschi, R.A.A.; Salahub, D.R.,
The high resolution photoelectron spectra of some iodoalkanes, iodocycloalkanes, iodoalkenes, and fluoroiodohydrocarbons,
Can. J. Chem., 1974, 52, 1217. [all data]