Ethyne, chloro-
- Formula: C2HCl
- Molecular weight: 60.482
- IUPAC Standard InChIKey: DIWKDXFZXXCDLF-UHFFFAOYSA-N
- CAS Registry Number: 593-63-5
- Chemical structure:

Gas phase thermochemistry data

Data compiled as indicated in comments:
DRB - Donald R. Burgess, Jr.
Quantity | Value | Units | Method | Reference | Comment |
---|---|---|---|---|---|
ΔfH°gas | 213.80 | kJ/mol | Review | Chase, 1998 | Data last reviewed in December, 1968 |
ΔfH°gas | 226. ± 10. | kJ/mol | Review | Manion, 2002 | estimate based on a diverse set of quantum calculations; DRB |
Quantity | Value | Units | Method | Reference | Comment |
S°gas,1 bar | 241.99 | J/mol*K | Review | Chase, 1998 | Data last reviewed in December, 1968 |
Gas Phase Heat Capacity (Shomate Equation)
Cp° = A + B*t + C*t2 + D*t3 +
E/t2
H° − H°298.15= A*t + B*t2/2 +
C*t3/3 + D*t4/4 − E/t + F − H
S° = A*ln(t) + B*t + C*t2/2 + D*t3/3 −
E/(2*t2) + G
Cp = heat capacity (J/mol*K)
H° = standard enthalpy (kJ/mol)
S° = standard entropy (J/mol*K)
t = temperature (K) / 1000.
View plot Requires a JavaScript / HTML 5 canvas capable browser.
Temperature (K) | 298. to 1400. | 1400. to 6000. |
---|---|---|
A | 54.00456 | 79.66587 |
B | 31.27360 | 3.739003 |
C | -12.19971 | -0.683887 |
D | 1.881603 | 0.043788 |
E | -0.710548 | -9.923236 |
F | 194.0301 | 169.7369 |
G | 294.5498 | 312.5067 |
H | 213.8024 | 213.8024 |
Reference | Chase, 1998 | Chase, 1998 |
Comment | Data last reviewed in December, 1968 | Data last reviewed in December, 1968 |

Condensed phase thermochemistry data

Data compiled by: Donald R. Burgess, Jr.
Quantity | Value | Units | Method | Reference | Comment |
---|---|---|---|---|---|
ΔfH°liquid | 207. ± 10. | kJ/mol | Review | Manion, 2002 | derived from recommended ΔfHgas° and ΔvapH° |

Phase change data

Data compiled as indicated in comments:
DRB - Donald R. Burgess, Jr.
AC - William E. Acree, Jr., James S. Chickos
Quantity | Value | Units | Method | Reference | Comment |
---|---|---|---|---|---|
ΔvapH° | 20. ± 1. | kJ/mol | Review | Manion, 2002 | extrapolation based on vapor pressure data of Bashford, Emeleus, et al., 1938 plus a correction for non-ideality; DRB |
Enthalpy of vaporization
ΔvapH (kJ/mol) | Temperature (K) | Method | Reference | Comment |
---|---|---|---|---|
21.8 | 223. | A | Stephenson and Malanowski, 1987 | Based on data from 204. to 238. K.; AC |

Reaction thermochemistry data

Data compiled by: Hussein Y. Afeefy, Joel F. Liebman, and Stephen E. Stein
Individual Reactions
By formula: C2H2Cl2 = C2HCl + HCl
Quantity | Value | Units | Method | Reference | Comment |
---|---|---|---|---|---|
ΔrH° | 9.6 | kJ/mol | Kin | Laursen and Pimentel, 1989 | gas phase; Photolysis |

Gas phase ion energetics data

Data evaluated as indicated in comments:
L - Sharon G. Lias
Data compiled as indicated in comments:
LBLHLM - Sharon G. Lias, John E. Bartmess, Joel F. Liebman, John L. Holmes, Rhoda D. Levin, and W. Gary Mallard
LLK - Sharon G. Lias, Rhoda D. Levin, and Sherif A. Kafafi
RDSH - Henry M. Rosenstock, Keith Draxl, Bruce W. Steiner, and John T. Herron
Quantity | Value | Units | Method | Reference | Comment |
---|---|---|---|---|---|
IE (evaluated) | 10.60 ± 0.02 | eV | N/A | N/A | L |
Ionization energy determinations
IE (eV) | Method | Reference | Comment |
---|---|---|---|
10.6 | PE | Maier and Thommen, 1984 | LBLHLM |
10.58 ± 0.02 | PE | Allan, Kloster-Jensen, et al., 1977 | LLK |
11.044 ± 0.004 | S | Evans, Scheps, et al., 1973 | LLK |
10.7 ± 0.1 | EI | Kloster-Jensen, Pascual, et al., 1970 | RDSH |
10.63 | PE | Haink, Heilbronner, et al., 1970 | RDSH |
Appearance energy determinations
Ion | AE (eV) | Other Products | Method | Reference | Comment |
---|---|---|---|---|---|
CCl+ | 17.2 ± 0.1 | CH | EI | Kloster-Jensen, Pascual, et al., 1970 | RDSH |
CH+ | 18.7 ± 0.2 | CCl | EI | Kloster-Jensen, Pascual, et al., 1970 | RDSH |
C2Cl+ | 15.8 ± 0.1 | H | PE | Allan, Kloster-Jensen, et al., 1977 | Unpublished result of H. Baumgartel, E. Kloster-Jensen, W. Lohr, J.P. Maier, H. Oertel, and H. Schenk; LLK |
C2H+ | 16.24 | Cl | PI | Eland, 1979 | Unpublished result of S.I.Miller and J.Berkowitz; LLK |
C2H+ | 15.8 ± 0.1 | Cl | PE | Allan, Kloster-Jensen, et al., 1977 | Unpublished result of H. Baumgartel, E. Kloster-Jensen, W. Lohr, J.P. Maier, H. Oertel, and H. Schenk; LLK |
Cl+ | 17.97 | C2H | PI | Eland, 1979 | Unpublished result of S.I.Miller and J.Berkowitz; LLK |

Vibrational and/or electronic energy levels

Data compiled by: Takehiko Shimanouchi
Symmetry: C∞ν Symmetry Number σ = 1
Sym. | No | Approximate | Selected Freq. | Infrared | Raman | Comments | ||||
---|---|---|---|---|---|---|---|---|---|---|
Species | type of mode | Value | Rating | Value | Phase | Value | Phase | |||
σ+ | 1 | CH str | 3340 | B | 3340 VS | gas | ||||
σ+ | 2 | CC str | 2110 | B | 2110 VS | gas | ||||
σ+ | 3 | CCl str | 756 | B | 756 VS | gas | ||||
π | 4 | CH bend | 604 | B | 604 S | gas | ||||
π | 5 | CCCl bend | 326 | B | 326 W | gas | ||||
Source: Shimanouchi, 1972

Normal alkane RI, non-polar column, temperature ramp

View large format table.

Column type Active phase I Reference Comment
CapillaryOV-101320.Zenkevich, 200525. m/0.20 mm/0.10 μm, N2/He, 6. K/min; Tstart: 50. C; Tend: 250. C

References

Chase, 1998
Chase, M.W., Jr.,
NIST-JANAF Themochemical Tables, Fourth Edition,
J. Phys. Chem. Ref. Data, Monograph 9, 1998, 1-1951. [all data]
Manion, 2002
Manion, J.A.,
Evaluated Enthalpies of Formation of the Stable Closed Shell C1 and C2 Chlorinated Hydrocarbons,
J. Phys. Chem. Ref. Data, 2002, 31, 1, 123-172, https://doi.org/10.1063/1.1420703
. [all data]
Bashford, Emeleus, et al., 1938
Bashford, L.A.; Emeleus, H.J.; Briscoe, H.V.A.,
255. The oxidation of chloroacetylene and bromoacetylene,
J. Chem. Soc., 1938, 1358, https://doi.org/10.1039/jr9380001358
. [all data]
Stephenson and Malanowski, 1987
Stephenson, Richard M.; Malanowski, Stanislaw,
Handbook of the Thermodynamics of Organic Compounds, 1987, https://doi.org/10.1007/978-94-009-3173-2
. [all data]
Laursen and Pimentel, 1989
Laursen, S.L.; Pimentel, G.C.,
Matrix-induced intersystem crossing in the photochemistry of the 1,2-dichloroethenes,
J. Phys. Chem., 1989, 93, 2328-2333. [all data]
Maier and Thommen, 1984
Maier, J.P.; Thommen, F.,
Relaxation dynamics of open-shell cations studied by photoelectron-photon coincidence spectroscopy,
Gas Phase Ion Chem., 1984, 3, 357. [all data]
Allan, Kloster-Jensen, et al., 1977
Allan, M.; Kloster-Jensen, E.; Maier, J.P.,
Emission spectra of Cl-C≡C-H+, Br-C≡C-H+ and I-C≡C-H+ radical cations: A2Π → X.2Π band systems and the decay of the A2Π states,
J. Chem. Soc. Faraday Trans. 2, 1977, 73, 1406. [all data]
Evans, Scheps, et al., 1973
Evans, K.; Scheps, R.; Rice, S.A.; Heller, D.,
Primary photochemical and photophysical processes in chloro- and bromo-acetylene,
J. Chem. Soc. Faraday Trans. 2, 1973, 69, 856. [all data]
Kloster-Jensen, Pascual, et al., 1970
Kloster-Jensen, E.; Pascual, C.; Vogt, J.,
Mass spectrometric studies of mono- and di-haloacetylenes,,
Helv. Chim. Acta, 1970, 53, 2109. [all data]
Haink, Heilbronner, et al., 1970
Haink, H.J.; Heilbronner, E.; Hornung, V.; KlosterJensen, E.,
Die Photoelektron-Spektren der Monohalogenacetylene,
Helv. Chim. Acta, 1970, 53, 1073. [all data]
Eland, 1979
Eland, J.H.D.,
Dissociations of state-selected C2H2+, H2S+ and D2S+ ions studied by photoelectron-photoion coincidence spectroscopy,
Int. J. Mass Spectrom. Ion Phys., 1979, 31, 161. [all data]
Shimanouchi, 1972
Shimanouchi, T.,
Tables of Molecular Vibrational Frequencies Consolidated Volume I, National Bureau of Standards, 1972, 1-160. [all data]