Methylarsine

Gas phase ion energetics data

Data compiled as indicated in comments:
LBLHLM - Sharon G. Lias, John E. Bartmess, Joel F. Liebman, John L. Holmes, Rhoda D. Levin, and W. Gary Mallard
RDSH - Henry M. Rosenstock, Keith Draxl, Bruce W. Steiner, and John T. Herron

Ionization energy determinations

IE (eV) Method Reference Comment
8.5PEElbel, Dieck, et al., 1982LBLHLM
9.7 ± 0.1EICullen and Frost, 1962RDSH
9.50PEElbel, Dieck, et al., 1982Vertical value; LBLHLM

References

Elbel, Dieck, et al., 1982
Elbel, S.; Dieck, H.T.; Demuth, R., Photoelectron sSpectra of group V compounds. IX. The relative perfluoroalkyl substituent effect, J. Fluorine Chem., 1982, 19, 349. [all data]

Cullen and Frost, 1962
Cullen, W.R.; Frost, D.C., Ionization potentials of some perfluoroalkyl arsines, Can. J. Chem., 1962, 40, 390. [all data]