Ethane, 1-bromo-2-ethoxy-
- Formula: C4H9BrO
- Molecular weight: 153.018
- IUPAC Standard InChIKey: MMYKTRPLXXWLBC-UHFFFAOYSA-N
- CAS Registry Number: 592-55-2
- Chemical structure:
View 3d structure (requires JavaScript / HTML 5) - Other names: Ether, 2-bromoethyl ethyl; 1-Bromo-2-ethoxyethane; 1-Bromo-2-ethoxyethylene; 1-Ethoxy-2-bromoethane; 2-Bromoethyl ethyl ether; 2-Ethoxyethyl bromide; 2-Bromoethoxyethane; UN 2340; NSC 8026; 1-Bromo-3-oxapentane; Ethyl 2-bromoethyl ether

Phase change data

Data compiled as indicated in comments:
TRC - Thermodynamics Research Center, NIST Boulder Laboratories, Chris Muzny director
BS - Robert L. Brown and Stephen E. Stein
Quantity | Value | Units | Method | Reference | Comment |
---|---|---|---|---|---|
Tboil | 398. | K | N/A | Akagi, Oae, et al., 1956 | Uncertainty assigned by TRC = 2. K; TRC |
Reduced pressure boiling point
Tboil (K) | Pressure (bar) | Reference | Comment |
---|---|---|---|
422.7 | 1.00 | Aldrich Chemical Company Inc., 1990 | BS |
313.2 | 0.032 | Weast and Grasselli, 1989 | BS |
303. to 305. | 0.016 | Frinton Laboratories Inc., 1986 | BS |

Gas phase ion energetics data

Data compiled by: Sharon G. Lias, John E. Bartmess, Joel F. Liebman, John L. Holmes, Rhoda D. Levin, and W. Gary Mallard
Ionization energy determinations
IE (eV) | Method | Reference | Comment |
---|---|---|---|
9.5 | PE | Ohno, Imai, et al., 1985 | |
9.94 | PE | Ohno, Imai, et al., 1985 | Vertical value |

Normal alkane RI, non-polar column, custom temperature program

Column type | Active phase | I | Reference | Comment |
---|---|---|---|---|
Capillary | OV-1, SE-30, Methyl silicone, SP-2100, OV-101, DB-1, etc. | 798. | Waggott and Davies, 1984 | Hydrogen; Column length: 50. m; Column diameter: 0.32 mm; Program: not specified |
Packed | Squalane | 789.4 | Keiko, Prokop'ev, et al., 1972 | Program: not specified |
Packed | Apiezon L | 798.4 | Keiko, Prokop'ev, et al., 1972 | Program: not specified |

References

Akagi, Oae, et al., 1956
Akagi, K.; Oae, S.; Murakami, M.,
Effect of Substituent on the Reactivity of ω-Substituted Primary Alkyl Halide in the Reaction wtih Sodium Thiosulfate,
J. Am. Chem. Soc., 1956, 78, 4034-7. [all data]
Aldrich Chemical Company Inc., 1990
Aldrich Chemical Company Inc.,
Catalog Handbook of Fine Chemicals, Aldrich Chemical Company, Inc., Milwaukee WI, 1990, 1. [all data]
Weast and Grasselli, 1989
CRC Handbook of Data on Organic Compounds, 2nd Editon, Weast,R.C and Grasselli, J.G., ed(s)., CRC Press, Inc., Boca Raton, FL, 1989, 1. [all data]
Frinton Laboratories Inc., 1986
Frinton Laboratories Inc.,
Catalog Number 11, Frinton Laboratories Inc., Vineland, NJ, 1986, 99. [all data]
Ohno, Imai, et al., 1985
Ohno, K.; Imai, K.; Harada, Y.,
Variations in reactivity of lone-pair electrons due to intramolecular hydrogen bonding as observed by penning ionization electron spectroscopy,
J. Am. Chem. Soc., 1985, 107, 8078. [all data]
Waggott and Davies, 1984
Waggott, A.; Davies, I.W.,
Identification of organic pollutants using linear temperature programmed retention indices (LTPRIs) - Part II, 1984, retrieved from http://dwi.defra.gov.uk/research/completed-research/reports/dwi0383.pdf. [all data]
Keiko, Prokop'ev, et al., 1972
Keiko, V.V.; Prokop'ev, B.V.; Kuz'menko, L.P.; Kalinina, N.A.; Modonov, V.B.,
The use of an additive scheme of calculation of the indices of retention in gas-liquid chromatography communication. 3. Some regularities in the manifestation of the inductive effect,
Izv. Akad. Nauk Kaz. SSR Ser. Khim., 1972, 12, 2629-2633. [all data]