1,2-Hexadiene
- Formula: C6H10
- Molecular weight: 82.1436
- IUPAC Standard InChIKey: XIAJQOBRHVKGSP-UHFFFAOYSA-N
- CAS Registry Number: 592-44-9
- Chemical structure:
View 3d structure (requires JavaScript / HTML 5) - Permanent link for this species. Use this link for bookmarking this species for future reference.

Phase change data

Data compiled by: Thermodynamics Research Center, NIST Boulder Laboratories, Chris Muzny director
Quantity | Value | Units | Method | Reference | Comment |
---|---|---|---|---|---|
Tboil | 348. | K | N/A | Labarre, 1963 | Uncertainty assigned by TRC = 2. K |
Tboil | 348.65 | K | N/A | Bourguel and Piaux, 1932 | Uncertainty assigned by TRC = 4. K |
Tboil | 351. | K | N/A | Bouis, 1928 | Uncertainty assigned by TRC = 2. K |

Gas phase ion energetics data

Data compiled as indicated in comments:
LLK - Sharon G. Lias, Rhoda D. Levin, and Sherif A. Kafafi
Ionization energy determinations
IE (eV) | Method | Reference | Comment |
---|---|---|---|
9.00 ± 0.05 | EI | Wolkoff, Holmes, et al., 1980 | LLK |
Appearance energy determinations
Ion | AE (eV) | Other Products | Method | Reference | Comment |
---|---|---|---|---|---|
C5H7+ | 9.12 ± 0.05 | CH3 | EI | Wolkoff, Holmes, et al., 1980 | LLK |

References

Labarre, 1963
Labarre, J.F.,
Contribution to the Study of Magneto-Optics of Bonds Between Atoms in Aliphatic Hydrocarbons,
Ann. Chim., 1963, 8, 45-83. [all data]
Bourguel and Piaux, 1932
Bourguel, M.; Piaux, L.,
Raman Effect in Chemistry. Allenic Hydrocarbons. Study and Preparation of 1,1-Dimethylallene,
Bull. Soc. Chim. Fr., 1932, 51, 1041. [all data]
Bouis, 1928
Bouis, M.,
Ann. Chim. (Paris), 1928, 9, 402. [all data]
Wolkoff, Holmes, et al., 1980
Wolkoff, P.; Holmes, J.L.; Lossing, F.P.,
On the formation of cyclopentenium cations from all C6H10+ molecular ion structures,
Can. J. Chem., 1980, 58, 251. [all data]