Heptane, 2-methyl-
- Formula: C8H18
- Molecular weight: 114.2285
- IUPAC Standard InChIKey: JVSWJIKNEAIKJW-UHFFFAOYSA-N
- CAS Registry Number: 592-27-8
- Chemical structure:
View 3d structure (requires JavaScript / HTML 5) - Isotopologues:
- Other names: 2-Methylheptane; (CH3)2CH(CH2)4CH3; Methylheptane

Gas phase thermochemistry data

Data compiled as indicated in comments:
ALS - Hussein Y. Afeefy, Joel F. Liebman, and Stephen E. Stein
GT - Glushko Thermocenter, Russian Academy of Sciences, Moscow
Quantity | Value | Units | Method | Reference | Comment |
---|---|---|---|---|---|
ΔfH°gas | -215.5 ± 1.3 | kJ/mol | Ccb | Prosen and Rossini, 1945 | ALS |
Quantity | Value | Units | Method | Reference | Comment |
S°gas | 459.49 ± 0.88 | J/mol*K | N/A | Messerly J.F., 1971 | GT |
Constant pressure heat capacity of gas
Cp,gas (J/mol*K) | Temperature (K) | Reference | Comment |
---|---|---|---|
186.13 | 298.15 | Colgate S.O., 1990 | GT |
202.07 | 323.15 | ||
230.06 | 373.15 | ||
248.37 | 408.15 | ||
265.52 | 448.15 |
Constant pressure heat capacity of gas
Cp,gas (J/mol*K) | Temperature (K) | Reference | Comment |
---|---|---|---|
135.65 | 200. | Scott D.W., 1974 | Recommended values were obtained from the consistent correlation scheme for alkanes [ Scott D.W., 1974, 2, Scott D.W., 1974]. This approach gives a good agreement with experimental data available for alkanes. However, large uncertainties could be expected at high temperatures.; GT |
173.89 | 273.15 | ||
187.2 ± 0.2 | 298.15 | ||
188.20 | 300. | ||
241.25 | 400. | ||
288.78 | 500. | ||
329.28 | 600. | ||
363.17 | 700. | ||
391.62 | 800. | ||
416.31 | 900. | ||
436.81 | 1000. | ||
454.80 | 1100. | ||
470.70 | 1200. | ||
485.34 | 1300. | ||
497.90 | 1400. | ||
510.45 | 1500. |

Condensed phase thermochemistry data

Data compiled as indicated in comments:
ALS - Hussein Y. Afeefy, Joel F. Liebman, and Stephen E. Stein
DH - Eugene S. Domalski and Elizabeth D. Hearing
Quantity | Value | Units | Method | Reference | Comment |
---|---|---|---|---|---|
ΔfH°liquid | -255.2 ± 1.3 | kJ/mol | Ccb | Prosen and Rossini, 1945 | ALS |
Quantity | Value | Units | Method | Reference | Comment |
ΔcH°liquid | -5465.5 ± 1.2 | kJ/mol | Ccb | Prosen and Rossini, 1945 | Corresponding ΔfHºliquid = -255.1 kJ/mol (simple calculation by NIST; no Washburn corrections); ALS |
ΔcH°liquid | -5447.1 | kJ/mol | Ccb | Fajans, 1920 | Corresponding ΔfHºliquid = -273. kJ/mol (simple calculation by NIST; no Washburn corrections); ALS |
ΔcH°liquid | -5274.6 | kJ/mol | Ccb | Richards and Jesse, 1910 | At 293 K; Corresponding ΔfHºliquid = -446.0 kJ/mol (simple calculation by NIST; no Washburn corrections); ALS |
Quantity | Value | Units | Method | Reference | Comment |
S°liquid | 356.39 | J/mol*K | N/A | Messerly and Finke, 1971 | DH |
Constant pressure heat capacity of liquid
Cp,liquid (J/mol*K) | Temperature (K) | Reference | Comment |
---|---|---|---|
252.00 | 298.15 | Messerly and Finke, 1971 | T = 11 to 370 K.; DH |
251.58 | 298.15 | Osborne and Ginnings, 1947 | T = 283 to 318 K.; DH |

Phase change data

Data compiled as indicated in comments:
BS - Robert L. Brown and Stephen E. Stein
TRC - Thermodynamics Research Center, NIST Boulder Laboratories, Chris Muzny director
AC - William E. Acree, Jr., James S. Chickos
ALS - Hussein Y. Afeefy, Joel F. Liebman, and Stephen E. Stein
DH - Eugene S. Domalski and Elizabeth D. Hearing
Quantity | Value | Units | Method | Reference | Comment |
---|---|---|---|---|---|
Tboil | 390.7 ± 0.8 | K | AVG | N/A | Average of 37 out of 38 values; Individual data points |
Quantity | Value | Units | Method | Reference | Comment |
Tfus | 163. ± 2. | K | AVG | N/A | Average of 14 values; Individual data points |
Quantity | Value | Units | Method | Reference | Comment |
Ttriple | 160. ± 9. | K | AVG | N/A | Average of 10 values; Individual data points |
Quantity | Value | Units | Method | Reference | Comment |
Tc | 559.7 ± 0.1 | K | N/A | Daubert, 1996 | |
Tc | 559.7 | K | N/A | Abara, Jennings, et al., 1988 | Uncertainty assigned by TRC = 0.2 K; TRC |
Tc | 559.6 | K | N/A | Majer and Svoboda, 1985 | |
Tc | 559.56 | K | N/A | McMicking and Kay, 1965 | Uncertainty assigned by TRC = 0.4 K; TRC |
Tc | 559.57 | K | N/A | Ambrose, Cox, et al., 1960 | Uncertainty assigned by TRC = 0.2 K; Visual, PRT, IPTS-48; TRC |
Quantity | Value | Units | Method | Reference | Comment |
Pc | 25.0 ± 0.2 | bar | N/A | Daubert, 1996 | |
Pc | 25.00 | bar | N/A | Abara, Jennings, et al., 1988 | Uncertainty assigned by TRC = 0.40 bar; TRC |
Pc | 24.842 | bar | N/A | McMicking and Kay, 1965 | Uncertainty assigned by TRC = 0.4053 bar; TRC |
Quantity | Value | Units | Method | Reference | Comment |
Vc | 0.488 | l/mol | N/A | Daubert, 1996 | |
Quantity | Value | Units | Method | Reference | Comment |
ρc | 2.05 ± 0.02 | mol/l | N/A | Daubert, 1996 | |
ρc | 2.05 | mol/l | N/A | McMicking and Kay, 1965 | Uncertainty assigned by TRC = 0.04 mol/l; TRC |
Quantity | Value | Units | Method | Reference | Comment |
ΔvapH° | 39. ± 5. | kJ/mol | AVG | N/A | Average of 6 values; Individual data points |
Reduced pressure boiling point
Tboil (K) | Pressure (bar) | Reference | Comment |
---|---|---|---|
389.2 | 1.01 | Aldrich Chemical Company Inc., 1990 | BS |
Enthalpy of vaporization
ΔvapH (kJ/mol) | Temperature (K) | Method | Reference | Comment |
---|---|---|---|---|
33.26 | 390.8 | N/A | Majer and Svoboda, 1985 | |
39.8 | 300. | A | Stephenson and Malanowski, 1987 | Based on data from 285. to 392. K.; AC |
41.6 | 268. | IP | Stephenson and Malanowski, 1987 | Based on data from 233. to 283. K. See also Osborn and Douslin, 1974.; AC |
38.7 ± 0.1 | 313. | C | Majer, Svoboda, et al., 1979 | AC |
37.3 ± 0.1 | 333. | C | Majer, Svoboda, et al., 1979 | AC |
36.0 ± 0.1 | 353. | C | Majer, Svoboda, et al., 1979 | AC |
38.1 | 330. | MM | Willingham, Taylor, et al., 1945 | Based on data from 315. to 391. K.; AC |
Enthalpy of vaporization
ΔvapH =
A exp(-βTr) (1 − Tr)β
ΔvapH =
Enthalpy of vaporization (at saturation pressure)
(kJ/mol)
Tr = reduced temperature (T / Tc)
View plot Requires a JavaScript / HTML 5 canvas capable browser.
Temperature (K) | A (kJ/mol) | β | Tc (K) | Reference | Comment |
---|---|---|---|---|---|
298. to 353. | 57.87 | 0.2919 | 559.6 | Majer and Svoboda, 1985 |
Antoine Equation Parameters
log10(P) = A − (B / (T + C))
P = vapor pressure (bar)
T = temperature (K)
View plot Requires a JavaScript / HTML 5 canvas capable browser.
Temperature (K) | A | B | C | Reference | Comment |
---|---|---|---|---|---|
233. to 283. | 4.84562 | 1718.531 | -29.682 | Osborn and Douslin, 1974 | Coefficents calculated by NIST from author's data. |
314.86 to 391.69 | 4.04227 | 1337.468 | -59.457 | Williamham, Taylor, et al., 1945 |
Enthalpy of fusion
ΔfusH (kJ/mol) | Temperature (K) | Reference | Comment |
---|---|---|---|
11.920 | 64.19 | Messerly and Finke, 1971 | DH |
11.92 | 164.2 | Domalski and Hearing, 1996 | AC |
Entropy of fusion
ΔfusS (J/mol*K) | Temperature (K) | Reference | Comment |
---|---|---|---|
72.60 | 64.19 | Messerly and Finke, 1971 | DH |

Reaction thermochemistry data

Data compiled by: Hussein Y. Afeefy, Joel F. Liebman, and Stephen E. Stein
Individual Reactions
By formula: C8H18 = C8H18
Quantity | Value | Units | Method | Reference | Comment |
---|---|---|---|---|---|
ΔrH° | -5.23 ± 0.92 | kJ/mol | Ciso | Prosen and Rossini, 1945, 2 | liquid phase; Calculated from ΔHc |
By formula: H2 + C8H16 = C8H18
Quantity | Value | Units | Method | Reference | Comment |
---|---|---|---|---|---|
ΔrH° | -115.1 ± 0.7 | kJ/mol | Chyd | Rogers, Dejroongruang, et al., 1992 | liquid phase; solvent: Cyclohexane |
By formula: H2 + C8H16 = C8H18
Quantity | Value | Units | Method | Reference | Comment |
---|---|---|---|---|---|
ΔrH° | -126.4 ± 2.0 | kJ/mol | Chyd | Rogers, Dejroongruang, et al., 1992 | liquid phase; solvent: Cyclohexane |
By formula: C8H18 = C8H18
Quantity | Value | Units | Method | Reference | Comment |
---|---|---|---|---|---|
ΔrH° | 1.86 ± 0.42 | kJ/mol | Eqk | Roganov, Kabo, et al., 1972 | gas phase; At 1368 K |
By formula: C8H18 = C8H18
Quantity | Value | Units | Method | Reference | Comment |
---|---|---|---|---|---|
ΔrH° | 1.3 ± 0.4 | kJ/mol | Eqk | Roganov, Kabo, et al., 1972 | gas phase; At 368 K |

Henry's Law data

Data compiled by: Rolf Sander
Henry's Law constant (water solution)
kH(T) = k°H exp(d(ln(kH))/d(1/T) ((1/T) - 1/(298.15 K)))
k°H = Henry's law constant for solubility in water at 298.15 K (mol/(kg*bar))
d(ln(kH))/d(1/T) = Temperature dependence constant (K)
k°H (mol/(kg*bar)) | d(ln(kH))/d(1/T) (K) | Method | Reference | Comment |
---|---|---|---|---|
0.00027 | Q | N/A | Several references are given in the list of Henry's law constants but not assigned to specific species. | |
0.00027 | Q | N/A | missing citation give several references for the Henry's law constants but don't assign them to specific species. |

Gas phase ion energetics data

Data evaluated as indicated in comments:
L - Sharon G. Lias
Data compiled as indicated in comments:
LL - Sharon G. Lias and Joel F. Liebman
LBLHLM - Sharon G. Lias, John E. Bartmess, Joel F. Liebman, John L. Holmes, Rhoda D. Levin, and W. Gary Mallard
LLK - Sharon G. Lias, Rhoda D. Levin, and Sherif A. Kafafi
Quantity | Value | Units | Method | Reference | Comment |
---|---|---|---|---|---|
IE (evaluated) | 9.84 ± 0.10 | eV | N/A | N/A | L |
Ionization energy determinations
IE (eV) | Method | Reference | Comment |
---|---|---|---|
9.76 | EST | Luo and Pacey, 1992 | LL |
9.84 ± 0.10 | EVAL | Lias, 1982 | LBLHLM |
9.74 ± 0.15 | EQ | Mautner(Meot-Ner), Sieck, et al., 1981 | LLK |

Kovats' RI, non-polar column, isothermal

Column type | Active phase | Temperature (C) | I | Reference | Comment |
---|---|---|---|---|---|
Capillary | OV-101 | 40. | 765.5 | Chen, Liang, et al., 2001 | He; Column length: 50. m; Column diameter: 0.25 mm |
Capillary | OV-101 | 60. | 765.8 | Chen, Liang, et al., 2001 | He; Column length: 50. m; Column diameter: 0.25 mm |
Capillary | Squalane | 100. | 765. | Heinzen, Soares, et al., 1999 | |
Capillary | OV-101 | 0. | 766. | Skrbic, 1997 | |
Packed | Squalane | 78.5 | 766.3 | Zhang and Lu, 1996 | |
Capillary | Squalane | 25. | 765. | Hilal, Carreira, et al., 1994 | |
Capillary | OV-1 | 60. | 767. | Engewald, Maurer, et al., 1989 | |
Capillary | OV-101 | 40. | 765. | Laub and Purnell, 1988 | |
Capillary | OV-101 | 60. | 765. | Laub and Purnell, 1988 | |
Capillary | OV-101 | 80. | 765. | Laub and Purnell, 1988 | |
Capillary | Squalane | 50. | 764.7 | Lunskii and Paizanskaya, 1988 | He; Column length: 50. m; Column diameter: 0.22 mm |
Capillary | Squalane | 70. | 765.6 | Lunskii and Paizanskaya, 1988 | He; Column length: 50. m; Column diameter: 0.22 mm |
Capillary | OV-101 | 40. | 766.0 | Boneva and Dimov, 1986 | 100. m/0.27 mm/0.9 μm |
Capillary | OV-101 | 50. | 766.2 | Boneva and Dimov, 1986 | 100. m/0.27 mm/0.9 μm |
Capillary | OV-101 | 60. | 766.3 | Boneva and Dimov, 1986 | 100. m/0.27 mm/0.9 μm |
Capillary | OV-101 | 70. | 766.3 | Boneva and Dimov, 1986 | 100. m/0.27 mm/0.9 μm |
Capillary | OV-101 | 30. | 765. | Chien, Furio, et al., 1983 | |
Capillary | OV-101 | 40. | 765. | Chien, Furio, et al., 1983 | |
Capillary | OV-101 | 50. | 765. | Chien, Furio, et al., 1983 | |
Capillary | OV-101 | 60. | 765. | Chien, Furio, et al., 1983 | |
Capillary | OV-101 | 70. | 765. | Chien, Furio, et al., 1983 | |
Capillary | OV-101 | 80. | 765. | Chien, Furio, et al., 1983 | |
Capillary | DB-1 | 60. | 766.5 | Lubeck and Sutton, 1983 | Column length: 60. m; Column diameter: 0.264 mm |
Capillary | DB-1 | 60. | 766.4 | Lubeck and Sutton, 1983 | 60. m/0.259 mm/1. μm |
Capillary | OV-1 | 50. | 766. | Anders, Scheller, et al., 1982 | Column length: 55. m; Column diameter: 0.21 mm |
Capillary | OV-101 | 50. | 766. | Johansen and Ettre, 1982 | 100. m/0.27 mm/0.20 μm |
Capillary | OV-101 | 50. | 766. | Johansen and Ettre, 1982 | 55. m/0.27 mm/0.9 μm |
Capillary | SF-96 | 50. | 766. | Johansen and Ettre, 1982 | 91.4 m/0.31 mm/0.20 μm |
Capillary | OV-1 | 60. | 754. | Nijs and Jacobs, 1981 | He; Column length: 150. m; Column diameter: 0.50 mm |
Packed | Triacontane | 80. | 764. | Castello and D'Amato, 1979 | He, Chromosorb W AW (60-80 mesh); Column length: 3. m |
Packed | Squalane | 80. | 765. | Castello and D'Amato, 1979 | He, Chromosorb W AW (60-80 mesh); Column length: 3. m |
Packed | OV-1 | 80. | 766. | Dimov and Papazova, 1979 | Chromosorb W AW DMCS (80-100 mesh); Column length: 4. m |
Capillary | Squalane | 86. | 765.2 | Nabivach and Kirilenko, 1979 | N2; Column length: 50. m |
Capillary | Squalane | 70. | 764.9 | Nabivach and Kirilenko, 1979 | N2; Column length: 50. m |
Capillary | Squalane | 60. | 765. | Chretien and Dubois, 1976 | |
Capillary | Squalane | 100. | 764.6 | Lulova, Leont'eva, et al., 1976 | He; Column length: 120. m; Column diameter: 0.25 mm |
Capillary | Squalane | 100. | 764.6 | Lulova, Leont'eva, et al., 1976 | He; Column length: 120. m; Column diameter: 0.25 mm |
Capillary | Squalane | 60. | 765. | Ryba, 1976 | Column length: 50. m; Column diameter: 0.25 mm |
Capillary | Squalane | 60. | 765. | Ryba, 1976 | Column length: 50. m; Column diameter: 0.25 mm |
Capillary | Squalane | 50. | 765. | Rijks and Cramers, 1974 | N2; Column length: 100. m; Column diameter: 0.25 mm |
Capillary | Squalane | 70. | 765. | Rijks and Cramers, 1974 | N2; Column length: 100. m; Column diameter: 0.25 mm |
Capillary | Squalane | 50. | 772.52 | Gäumann and Bonzo, 1973 | Column length: 100. m |
Capillary | OV-101 | 50. | 766. | Pacáková, Hoch, et al., 1973 | 25. m/0.25 mm/1.39 μm, N2 |
Capillary | OV-101 | 60. | 766. | Pacáková, Hoch, et al., 1973 | 25. m/0.25 mm/1.39 μm, N2 |
Capillary | Vacuum Grease Oil (VM-4) | 35. | 763. | Sidorov, Petrova, et al., 1972 | |
Capillary | Vacuum Grease Oil (VM-4) | 45. | 763. | Sidorov, Petrova, et al., 1972 | |
Capillary | Vacuum Grease Oil (VM-4) | 50. | 763. | Sidorov, Petrova, et al., 1972 | |
Capillary | Vacuum Grease Oil (VM-4) | 58. | 763. | Sidorov, Petrova, et al., 1972 | |
Capillary | Vacuum Grease Oil (VM-4) | 68. | 763. | Sidorov, Petrova, et al., 1972 | |
Capillary | Squalane | 70. | 764.8 | Dimov and Schopov, 1971 | Column length: 100. m; Column diameter: 0.25 mm |
Packed | SE-30 | 75. | 767. | Robinson and Odell, 1971 | N2, Chromosorb W; Column length: 6.1 m |
Packed | Squalane | 100. | 765. | Robinson and Odell, 1971 | N2, Embacel; Column length: 3.0 m |
Packed | Squalane | 50. | 765.1 | Takács, Szita, et al., 1971 | N2, Chromosorb W; Column length: 3. m |
Packed | SE-30 | 80. | 764. | Mitra and Saha, 1970 | N2 |
Packed | Squalane | 25. | 764. | Mitra and Saha, 1970 | N2 |
Packed | Squalane | 80. | 765. | Mitra and Saha, 1970 | N2 |
Capillary | Squalane | 40. | 765. | Matukuma, 1969 | N2; Column length: 91.4 m; Column diameter: 0.25 mm |
Packed | Squalane | 27. | 764. | Hively and Hinton, 1968 | He, Chromosorb P; Column length: 15. m; Column diameter: 0.25 mm |
Packed | Squalane | 49. | 765. | Hively and Hinton, 1968 | He, Chromosorb P; Column length: 15. m; Column diameter: 0.25 mm |
Packed | Squalane | 67. | 765. | Hively and Hinton, 1968 | He, Chromosorb P; Column length: 15. m; Column diameter: 0.25 mm |
Packed | Squalane | 86. | 765. | Hively and Hinton, 1968 | He, Chromosorb P; Column length: 15. m; Column diameter: 0.25 mm |
Packed | Squalane | 30. | 764.5 | Tourres, 1967 | H2; Column length: 10. m |
Packed | Squalane | 50. | 765. | Tourres, 1967 | H2; Column length: 10. m |
Capillary | Squalane | 30. | 765. | Tourres, 1967, 2 | H2; Column length: 100. m; Column diameter: 0.25 mm |
Capillary | Squalane | 50. | 765. | Tourres, 1967, 2 | H2; Column length: 100. m; Column diameter: 0.25 mm |
Capillary | Squalane | 70. | 766. | Tourres, 1967, 2 | H2; Column length: 100. m; Column diameter: 0.25 mm |
Packed | Squalane | 100. | 765. | Evans, 1966 | Untreated celite; Column length: 1.8 m |
Packed | Squalane | 22. | 765. | Evans, 1966 | Untreated celite; Column length: 1.8 m |
Packed | Squalane | 30. | 764. | Evans, 1966 | Untreated celite; Column length: 1.8 m |
Packed | Squalane | 40. | 765. | Evans, 1966 | Untreated celite; Column length: 1.8 m |
Packed | Squalane | 55. | 765. | Evans, 1966 | Untreated celite; Column length: 1.8 m |
Packed | Squalane | 60. | 765. | Evans, 1966 | Untreated celite; Column length: 1.8 m |
Packed | Squalane | 70. | 766. | Evans, 1966 | Untreated celite; Column length: 1.8 m |
Packed | Squalane | 80. | 765. | Evans, 1966 | Untreated celite; Column length: 1.8 m |

Kovats' RI, non-polar column, temperature ramp

Column type | Active phase | I | Reference | Comment |
---|---|---|---|---|
Capillary | SE-54 | 763. | Rembold, Wallner, et al., 1989 | 30. m/0.25 mm/0.25 μm, He, 0. C @ 12. min, 12. K/min; Tend: 250. C |
Capillary | OV-101 | 761. | Hayes and Pitzer, 1982 | 110. m/0.25 mm/0.20 μm, He, 1. K/min; Tstart: 35. C; Tend: 200. C |
Capillary | Apiezon L | 760. | Louis, 1971 | N2, 1. K/min; Column length: 50. m; Column diameter: 0.25 mm; Tstart: 60. C |

Kovats' RI, non-polar column, custom temperature program

Column type | Active phase | I | Reference | Comment |
---|---|---|---|---|
Capillary | Petrocol DH-100 | 764.1 | Haagen-Smit Laboratory, 1997 | He; Column length: 100. m; Column diameter: 0.2 mm; Program: 5C(10min) => 5C/min => 50C(48min) => 1.5C/min => 195C(91min) |
Capillary | DB-1 | 769. | Hoekman, 1993 | 60. m/0.32 mm/1.0 μm, He; Program: -40 C for 12 min; -40 - 125 C at 3 deg.min; 125-185 C at 6 deg/min; 185 - 220 C at 20 deg/min; hold 220 C for 2 min |

Van Den Dool and Kratz RI, non-polar column, temperature ramp

Column type | Active phase | I | Reference | Comment |
---|---|---|---|---|
Capillary | SPB-5 | 765. | Engel and Ratel, 2007 | 60. m/0.32 mm/1. μm, 40. C @ 2. min, 3. K/min, 230. C @ 10. min |
Capillary | HP-5 | 778. | Insausti, Goñi, et al., 2005 | 50. m/0.32 mm/1.05 μm, He, 35. C @ 15. min, 8. K/min, 220. C @ 5. min |
Capillary | Petrocol DH | 766.9 | Censullo, Jones, et al., 2003 | 50. m/0.25 mm/0.5 μm, He, 35. C @ 10. min, 3. K/min, 200. C @ 10. min |
Capillary | SPB-1 | 761.38 | LECO Corporation, 2003 | 30. m/0.25 mm/0.25 μm, 40. C @ 2. min, 10. K/min, 250. C @ 2. min |
Capillary | SPB-1 | 761.79 | LECO Corporation, 2003 | 30. m/0.25 mm/0.25 μm, 40. C @ 2. min, 10. K/min, 250. C @ 2. min |
Capillary | DB-5 | 762.5 | Xu, van Stee, et al., 2003 | 30. m/0.25 mm/1. μm, He, 2.5 K/min; Tstart: 50. C; Tend: 200. C |
Capillary | OV-101 | 764.1 | Yin, Liu, et al., 2001 | N2, 1. K/min; Column length: 80. m; Column diameter: 0.22 mm; Tstart: 30. C; Tend: 130. C |
Capillary | PONA | 761.0 | Martos, Saraullo, et al., 1997 | 50. m/0.2 mm/0.5 μm, 35. C @ 0.5 min, 1. K/min, 220. C @ 8. min |
Capillary | PONA | 761.1 | Martos, Saraullo, et al., 1997 | 50. m/0.2 mm/0.5 μm, 35. C @ 0.5 min, 1. K/min, 220. C @ 8. min |
Capillary | Petrocol DH | 762.25 | Subramaniam, Bochniak, et al., 1994 | 100. m/0.25 mm/0.5 μm, He, 1. K/min; Tstart: 30. C; Tend: 220. C |
Capillary | Petrocol DH | 762.36 | Subramaniam, Bochniak, et al., 1994 | 100. m/0.25 mm/0.5 μm, He, 1. K/min; Tstart: 30. C; Tend: 220. C |
Capillary | Ultra-1 | 763. | Olson, Sinkevitch, et al., 1992 | 4. K/min; Tstart: -40. C; Tend: 230. C |
Capillary | Petrocol DH | 763.03 | White, Douglas, et al., 1992 | 100. m/0.25 mm/0.5 μm, He, 1. K/min; Tstart: 30. C; Tend: 220. C |
Capillary | Petrocol DH | 763.5 | White, Douglas, et al., 1992 | 100. m/0.25 mm/0.5 μm, He, 1. K/min; Tstart: 30. C; Tend: 220. C |
Capillary | Petrocol DH | 763. | White, Hackett, et al., 1992 | 100. m/0.25 mm/0.5 μm, He, 1. K/min; Tstart: 30. C; Tend: 220. C |
Capillary | HP-1 | 765.9 | Bangjie, Xijian, et al., 1987 | N2, 10. K/min; Column length: 25. m; Column diameter: 0.2 mm; Tstart: 30. C |
Capillary | HP-1 | 765.5 | Bangjie, Xijian, et al., 1987 | N2, 2. K/min; Column length: 25. m; Column diameter: 0.2 mm; Tstart: 30. C |
Capillary | HP-1 | 765.5 | Bangjie, Xijian, et al., 1987 | N2, 30. C @ 5. min, 5. K/min; Column length: 25. m; Column diameter: 0.2 mm |
Capillary | Ultra-1 | 766.78 | Haynes and Pitzer, 1985 | 50. m/0.22 mm/0.33 μm, He, 1. K/min; Tstart: -30. C; Tend: 240. C |
Capillary | Ultra-1 | 766.99 | Haynes and Pitzer, 1985 | 50. m/0.22 mm/0.33 μm, He, 2. K/min; Tstart: -30. C; Tend: 240. C |
Capillary | Ultra-1 | 767.12 | Haynes and Pitzer, 1985 | 50. m/0.22 mm/0.33 μm, He, 3. K/min; Tstart: -30. C; Tend: 240. C |
Capillary | Ultra-2 | 765.99 | Haynes and Pitzer, 1985 | 50. m/0.22 mm/0.33 μm, He, 1. K/min; Tstart: -30. C; Tend: 240. C |
Capillary | Ultra-2 | 766.21 | Haynes and Pitzer, 1985 | 50. m/0.22 mm/0.33 μm, He, 2. K/min; Tstart: -30. C; Tend: 240. C |
Capillary | Ultra-2 | 766.26 | Haynes and Pitzer, 1985 | 50. m/0.22 mm/0.33 μm, He, 3. K/min; Tstart: -30. C; Tend: 240. C |
Capillary | OV-101 | 761. | Hayes and Pitzer, 1981 | 108. m/0.25 mm/0.2 μm, 1. K/min; Tstart: 35. C; Tend: 200. C |

Van Den Dool and Kratz RI, non-polar column, custom temperature program

Column type | Active phase | I | Reference | Comment |
---|---|---|---|---|
Capillary | DB-5 | 760. | Zaikin and Borisov, 2002 | He; Column length: 30. m; Column diameter: 0.25 mm; Program: 30C => 5K/min=120C => 10C/min => 270C |
Capillary | Methyl Silicone | 776.21 | Hassoun, Pilling, et al., 1999 | 50. m/0.25 mm/1. μm, He; Program: -50C(2min) => 49.9C/min => 35C(10min) => 3C/min => 200C(2min) => 40C/min => 240C(30min) |
Capillary | OV-101 | 764. | Wu and Lu, 1984 | Program: not specified |

Van Den Dool and Kratz RI, polar column, temperature ramp

Column type | Active phase | I | Reference | Comment |
---|---|---|---|---|
Capillary | Supelcowax-10 | 750. | Elmore, Nisyrios, et al., 2005 | 60. m/0.25 mm/0.25 μm, He, 40. C @ 2. min, 4. K/min; Tend: 280. C |

Normal alkane RI, non-polar column, isothermal

Column type | Active phase | Temperature (C) | I | Reference | Comment |
---|---|---|---|---|---|
Capillary | OV-101 | 40. | 766. | Li and Deng, 1998 | N2; Column length: 51. m; Column diameter: 0.25 mm |
Capillary | Methyl Silicone | 50. | 765. | N/A | N2; Column length: 74.6 m; Column diameter: 0.28 mm |
Capillary | OV-101 | 50. | 766. | Wu and Lu, 1984, 2 | |
Capillary | OV-101 | 70. | 766. | Wu and Lu, 1984, 2 | |
Capillary | Squalane | 100. | 766. | Dimov N., 1976 | |
Capillary | Squalane | 70. | 765. | Dimov N., 1976 | |
Capillary | Squalane | 86. | 756. | Vigdergauz and Martynov, 1971 | He; Column length: 150. m; Column diameter: 0.35 mm |

Normal alkane RI, non-polar column, temperature ramp

Column type | Active phase | I | Reference | Comment |
---|---|---|---|---|
Capillary | Polydimethyl siloxane: CP-Sil 5 CB | 767. | Bramston-Cook, 2013 | 60. m/0.25 mm/1.0 μm, Helium, 45. C @ 1.45 min, 3.6 K/min, 210. C @ 2.72 min |
Capillary | Petrocol DH | 763. | Supelco, 2012 | 100. m/0.25 mm/0.50 μm, Helium, 20. C @ 15. min, 15. K/min, 220. C @ 30. min |
Capillary | PONA | 767. | Zhang, Ding, et al., 2009 | 50. m/0.20 mm/0.50 μm, Nitrogen, 35. C @ 15. min, 2. K/min, 200. C @ 10. min |
Capillary | OV-1 | 764.3 | Krkosova, Kubinec, et al., 2007 | 100. m/0.32 mm/0.25 μm, Helium, 5. K/min, 310. C @ 5. min; Tstart: 30. C |
Capillary | BP-1 | 765. | Health Safety Executive, 2000 | 50. m/0.22 mm/0.75 μm, He, 5. K/min; Tstart: 50. C; Tend: 200. C |
Capillary | SE-54 | 766. | Guan, Li, et al., 1995 | 60. C @ 2. min, 4. K/min; Column length: 50. m; Column diameter: 0.32 mm; Tend: 200. C |
Capillary | DB-1 | 775. | Ciccioli, Cecinato, et al., 1992 | 60. m/0.32 mm/1.2 μm, He, 30. C @ 10. min, 3. K/min; Tend: 240. C |
Capillary | OV-101 | 767. | Zenkevich and Ventura, 1991 | Helium, 50. C @ 0. min, 5. K/min, 240. C @ 0. min; Column length: 54. m; Column diameter: 0.26 mm |
Capillary | SE-30 | 760. | Hackett, Gibbon, et al., 1985 | He, 20. C @ 4. min, 2. K/min, 260. C @ 16. min; Column length: 50. m; Column diameter: 0.25 mm |

Normal alkane RI, non-polar column, custom temperature program

Column type | Active phase | I | Reference | Comment |
---|---|---|---|---|
Capillary | HP-1 | 759. | Barra, Baldovini, et al., 2007 | 50. m/0.2 mm/0.33 μm, He; Program: 40C(2min) => 2C/min => 200C => 15C/min => 250C (30min) |
Capillary | Methyl Silicone | 765. | Chen and Feng, 2007 | Program: not specified |
Capillary | Methyl Silicone | 765. | Feng and Mu, 2007 | Program: not specified |
Capillary | Methyl Silicone | 768. | Blunden, Aneja, et al., 2005 | 60. m/0.32 mm/1.0 μm, Helium; Program: -50 0C (2 min) 8 0C/min -> 200 0C (7.75 min) 25 0C -> 225 0C (8 min) |
Capillary | OV-101 | 765. | Du and Liang, 2003 | Program: not specified |
Capillary | Polydimethyl siloxane | 765. | Junkes, Castanho, et al., 2003 | Program: not specified |
Capillary | BP-1 | 758.54 | Cooke, Hassoun, et al., 2001 | 50. m/0.25 mm/1. μm, He; Program: -50C => 49.9C/min => 5C(3min) => 3C/min => 50C => 5C/min => 220C(20 min) |
Capillary | Polydimethyl siloxanes | 764. | Yin, Guo, et al., 2001 | Program: not specified |
Capillary | DB-1 | 766. | Zhu and Wang, 2001 | Program: not specified |
Capillary | Methyl Silicone | 763. | Spieksma, 1999 | Program: not specified |
Capillary | OV-1 | 766. | Zhu and He, 1999 | Program: not specified |
Capillary | OV-1 | 766. | Zhu and He, 1999 | Program: not specified |
Capillary | SE-54 | 765. | Zhu and He, 1999 | Program: not specified |
Capillary | SE-54 | 766. | Zhu and He, 1999 | Program: not specified |
Capillary | DB-1 | 766. | Ciccioli, Cecinato, et al., 1994 | 60. m/0.32 mm/0.25 μm; Program: not specified |
Capillary | OV-101 | 766. | Skrbic and Cvejanov, 1993 | Program: not specified |
Capillary | Squalane | 762. | Petrov, 1984 | Program: not specified |
Capillary | OV-1, SE-30, Methyl silicone, SP-2100, OV-101, DB-1, etc. | 761. | Waggott and Davies, 1984 | Hydrogen; Column length: 50. m; Column diameter: 0.32 mm; Program: not specified |
Capillary | OV-1, SE-30, Methyl silicone, SP-2100, OV-101, DB-1, etc. | 766. | Waggott and Davies, 1984 | Hydrogen; Column length: 50. m; Column diameter: 0.32 mm; Program: not specified |
Packed | SE-30 | 775. | Robinson and Odell, 1971 | N2, Chromosorb W; Column length: 6.1 m; Program: 50C910min) => 20C/min => 90(6min) => 10C/min => 150C(hold) |
Packed | Squalane | 772. | Robinson and Odell, 1971 | N2, Embacel; Column length: 3.0 m; Program: 25C(5min) => 2C/min => 35 => 4C/min => 95C(hold) |
Packed | SE-30 | 770. | Robinson and Odell, 1971, 2 | Chrom W; Column length: 6.1 m; Program: 50C(10min) => 20C/min(2min) => 90C(6min) => 10C/min(6min) => (hold at 150C) |
Packed | Squalane | 772. | Robinson and Odell, 1971, 2 | Embacel; Column length: 3.0 m; Program: 25C(5min) => 2C/min(5min) => 4C/min(15min) => (hold at 95C) |

Normal alkane RI, polar column, temperature ramp

Column type | Active phase | I | Reference | Comment |
---|---|---|---|---|
Capillary | RTX-Wax | 764. | Galindo-Cuspinera, Lubran, et al., 2002 | 60. m/0.25 mm/0.5 μm, He, 40. C @ 5. min, 5. K/min, 180. C @ 20. min |

References

Prosen and Rossini, 1945
Prosen, E.J.; Rossini, F.D.,
Heats of combustion and formation of the paraffin hydrocarbons at 25° C,
J. Res. NBS, 1945, 263-267. [all data]
Messerly J.F., 1971
Messerly J.F.,
Low-temperature thermal properties of 2-methylheptane and 2-methyldecane: the thermodynamic properties of 2-methylalkanes,
J. Chem. Thermodyn., 1971, 3, 675-687. [all data]
Colgate S.O., 1990
Colgate S.O.,
Acoustical determination of ideal gas heat capacities of three C-8 compounds,
Fluid Phase Equilib., 1990, 60, 191-203. [all data]
Scott D.W., 1974
Scott D.W.,
Chemical Thermodynamic Properties of Hydrocarbons and Related Substances. Properties of the Alkane Hydrocarbons, C1 through C10 in the Ideal Gas State from 0 to 1500 K. U.S. Bureau of Mines, Bulletin 666, 1974. [all data]
Scott D.W., 1974, 2
Scott D.W.,
Correlation of the chemical thermodynamic properties of alkane hydrocarbons,
J. Chem. Phys., 1974, 60, 3144-3165. [all data]
Fajans, 1920
Fajans, K.,
Die Energie der Atombindungen im Diamanten und in aliphatischen Kohlenwasserstoffen,
Ber., 1920, 53, 643-665. [all data]
Richards and Jesse, 1910
Richards, T.W.; Jesse, R.H., Jr.,
The heats of combustion of the octanes and xylenes,
J. Am. Chem. Soc., 1910, 32, 268-298. [all data]
Messerly and Finke, 1971
Messerly, J.F.; Finke, H.L.,
Low-temperature thermal properties of 2-methylheptane and 2-methyldecane: the thermodynamic properties of the 2-methylalkanes,
J. Chem. Thermodynam., 1971, 3, 675-687. [all data]
Osborne and Ginnings, 1947
Osborne, N.S.; Ginnings, D.C.,
Measurements of heat of vaporization and heat capacity of a number of hydrocarbons,
J. Res. NBS, 1947, 39, 453-477. [all data]
Daubert, 1996
Daubert, T.E.,
Vapor-Liquid Critical Properties of Elements and Compounds. 5. Branched Alkanes and Cycloalkanes,
J. Chem. Eng. Data, 1996, 41, 365-372. [all data]
Abara, Jennings, et al., 1988
Abara, J.A.; Jennings, D.W.; Kay, W.B.; Teja, A.S.,
Phase Behavior in the Critical Region of Six Binary Mixtures of 2-Methylalkanes,
J. Chem. Eng. Data, 1988, 33, 242. [all data]
Majer and Svoboda, 1985
Majer, V.; Svoboda, V.,
Enthalpies of Vaporization of Organic Compounds: A Critical Review and Data Compilation, Blackwell Scientific Publications, Oxford, 1985, 300. [all data]
McMicking and Kay, 1965
McMicking, J.H.; Kay, W.B.,
Vapor Pressures and Saturated Liquid and Vapor Densities of The Isomeric Heptanes and Isomeric Octanes,
Proc., Am. Pet. Inst., Sect. 3, 1965, 45, 75-90. [all data]
Ambrose, Cox, et al., 1960
Ambrose, D.; Cox, J.D.; Townsend, R.,
The critical temperatures of forty organic compounds,
Trans. Faraday Soc., 1960, 56, 1452. [all data]
Aldrich Chemical Company Inc., 1990
Aldrich Chemical Company Inc.,
Catalog Handbook of Fine Chemicals, Aldrich Chemical Company, Inc., Milwaukee WI, 1990, 1. [all data]
Stephenson and Malanowski, 1987
Stephenson, Richard M.; Malanowski, Stanislaw,
Handbook of the Thermodynamics of Organic Compounds, 1987, https://doi.org/10.1007/978-94-009-3173-2
. [all data]
Osborn and Douslin, 1974
Osborn, Ann G.; Douslin, Donald R.,
Vapor-pressure relations for 15 hydrocarbons,
J. Chem. Eng. Data, 1974, 19, 2, 114-117, https://doi.org/10.1021/je60061a022
. [all data]
Majer, Svoboda, et al., 1979
Majer, Vladimír; Svoboda, Václav; Hála, Slavoj; Pick, Jirí,
Temperature dependence of heats of vaporization of saturated hydrocarbons C5-C8; Experimental data and an estimation method,
Collect. Czech. Chem. Commun., 1979, 44, 3, 637-651, https://doi.org/10.1135/cccc19790637
. [all data]
Willingham, Taylor, et al., 1945
Willingham, C.B.; Taylor, W.J.; Pignocco, J.M.; Rossini, F.D.,
Vapor pressures and boiling points of some paraffin, alkylcyclopentane, alkylcyclohexane, and alkylbenzene hydrocarbons,
J. RES. NATL. BUR. STAN., 1945, 35, 3, 219-17, https://doi.org/10.6028/jres.035.009
. [all data]
Williamham, Taylor, et al., 1945
Williamham, C.B.; Taylor, W.J.; Pignocco, J.M.; Rossini, F.D.,
Vapor Pressures and Boiling Points of Some Paraffin, Alkylcyclopentane, Alkylcyclohexane, and Alkylbenzene Hydrocarbons,
J. Res. Natl. Bur. Stand. (U.S.), 1945, 35, 3, 219-244, https://doi.org/10.6028/jres.035.009
. [all data]
Domalski and Hearing, 1996
Domalski, Eugene S.; Hearing, Elizabeth D.,
Heat Capacities and Entropies of Organic Compounds in the Condensed Phase. Volume III,
J. Phys. Chem. Ref. Data, 1996, 25, 1, 1, https://doi.org/10.1063/1.555985
. [all data]
Prosen and Rossini, 1945, 2
Prosen, E.J.; Rossini, F.D.,
Heats of isomerization of the 18 octanes,
J. Res. NBS, 1945, 34, 163-174. [all data]
Rogers, Dejroongruang, et al., 1992
Rogers, D.W.; Dejroongruang, K.; Samuel, S.D.; Fang, W.; Zhao, Y.,
Enthalpies of hydrogenation of the octenes and the methylheptenes,
J. Chem. Thermodyn., 1992, 24, 561-565. [all data]
Roganov, Kabo, et al., 1972
Roganov, G.N.; Kabo, G.Ya.; Andreevskii, D.N.,
Thermodynamics of the isomerization of methylpentanes and methylheptanes,
Neftekhimiya, 1972, 12, 495-500. [all data]
Luo and Pacey, 1992
Luo, Y.-R.; Pacey, P.D.,
Effects of alkyl substitution on ionization energies of alkanes and haloalkanes and on heats of formation of their molecular cations. Part 2. Alkanes and chloro-, bromo- and iodoalkanes,
Int. J. Mass Spectrom. Ion Processes, 1992, 112, 63. [all data]
Lias, 1982
Lias, S.G.,
Thermochemical information from ion-molecule rate constants,
Ion Cyclotron Reson. Spectrom. 1982, 1982, 409. [all data]
Mautner(Meot-Ner), Sieck, et al., 1981
Mautner(Meot-Ner), M.; Sieck, L.W.; Ausloos, P.,
Ionization of normal alkanes: Enthalpy, entropy, structural, and isotope effects,
J. Am. Chem. Soc., 1981, 103, 5342. [all data]
Chen, Liang, et al., 2001
Chen, J.P.; Liang, X.M.; Zhang, Q.; Zhang, L.F.,
Prediction of GC retention values under various column temperature conditions from temperature programmed data,
Chromatographia, 2001, 53, 9/10, 539-547, https://doi.org/10.1007/BF02491619
. [all data]
Heinzen, Soares, et al., 1999
Heinzen, V.E.F.; Soares, M.F.; Yunes, R.A.,
Semi-empirical topological method for the prediction of the chromatographic retention of cis- and trans-alkene isomers and alkanes,
J. Chromatogr. A, 1999, 849, 2, 495-506, https://doi.org/10.1016/S0021-9673(99)00530-0
. [all data]
Skrbic, 1997
Skrbic, B.D.,
Unified retention concept -- statistical treatment of Kováts retention index,
J. Chromatogr. A, 1997, 764, 2, 257-264, https://doi.org/10.1016/S0021-9673(96)00955-7
. [all data]
Zhang and Lu, 1996
Zhang, X.; Lu, P.,
Unified equation between Kováts indices on different stationary phases for select types of compounds,
J. Chromatogr. A, 1996, 731, 1-2, 187-199, https://doi.org/10.1016/0021-9673(95)01213-3
. [all data]
Hilal, Carreira, et al., 1994
Hilal, S.H.; Carreira, L.A.; Karickhoff, S.W.; Melton, C.M.,
Estimation of Gas-Liquid Chromatographic Retention Times from Molecular Structure,
J. Chromatogr. A, 1994, 662, 2, 269-280, https://doi.org/10.1016/0021-9673(94)80515-6
. [all data]
Engewald, Maurer, et al., 1989
Engewald, W.; Maurer, T.; Schiefke, A.,
Investigation of isomeric hydrocarbons by gas-solid chromatography on graphitized thermal carbon black,
Pure Appl. Chem., 1989, 61, 11, 2001-2004, https://doi.org/10.1351/pac198961112001
. [all data]
Laub and Purnell, 1988
Laub, R.J.; Purnell, J.H.,
Specific retention volumes, retention indices, and family-plot regressions of aliphatic, alicyclic, and aromatic hydrocarbon solutes with OV-101 poly (dimethylsiloxane) stationary phase,
J. Hi. Res. Chromatogr. Chromatogr. Comm., 1988, 11, 9, 649-660, https://doi.org/10.1002/jhrc.1240110908
. [all data]
Lunskii and Paizanskaya, 1988
Lunskii, M.Kh.; Paizanskaya, I.L.,
Identification of hydrocarbons C1-C9 of petrol fractions of oils and condensates in the use of capillary columns with dinonylphthalate,
Zh. Anal. Khim., 1988, 43, 127-135. [all data]
Boneva and Dimov, 1986
Boneva, S.; Dimov, N.,
Unified retention index of hydrocarbons separated on dimethylsilicone OV-101,
Chromatographia, 1986, 21, 12, 697-700, https://doi.org/10.1007/BF02313682
. [all data]
Chien, Furio, et al., 1983
Chien, C.-F.; Furio, D.L.; Kopecni, M.M.; Laub, R.J.,
Specific Retention Volumes and Retention Indices of Selected Hydrocarbon Solutes with OV-101 and SP-2100 Polydimethylsiloxane Solvents,
J. Hi. Res. Chromatogr. Chromatogr. Comm., 1983, 6, 10, 577-580, https://doi.org/10.1002/jhrc.1240061013
. [all data]
Lubeck and Sutton, 1983
Lubeck, A.J.; Sutton, DL.,
Kovats retention indices of selected hydrocarbons through C10 on bonded phase fused silica capillaries,
J. Hi. Res. Chromatogr. Chromatogr. Comm., 1983, 6, 6, 328-332, https://doi.org/10.1002/jhrc.1240060612
. [all data]
Anders, Scheller, et al., 1982
Anders, G.; Scheller, M.; Schuhler, C.; Struppe, H.G.,
Zur Vorausberechnung von Bruttoretentioszeiten bei temperaturprogramierter Gaschromatographie mit Hilfe isotherm bestimmter Retentionsindices und einer Anpassung an experimentelle Retentionszeiten,
Chromatographia, 1982, 15, 1, 43-47, https://doi.org/10.1007/BF02269039
. [all data]
Johansen and Ettre, 1982
Johansen, N.G.; Ettre, L.S.,
Retention index values of hydrocarbons on open-tubular columns coated with methylsilicone liquid phases,
Chromatographia, 1982, 15, 10, 625-630, https://doi.org/10.1007/BF02279488
. [all data]
Nijs and Jacobs, 1981
Nijs, H.H.; Jacobs, P.A.,
On-Line Single Run Analysis of Effluents from a Fischer-Tropsch Reactor,
J. Chromatogr. Sci., 1981, 19, 1, 40-45, https://doi.org/10.1093/chromsci/19.1.40
. [all data]
Castello and D'Amato, 1979
Castello, G.; D'Amato, G.,
Use of Linear and Branched-Chain Paraffinic Liquid Phases as Non-Polar Reference Materials in Gas Chromatography,
J. Chromatogr., 1979, 175, 1, 27-35, https://doi.org/10.1016/S0021-9673(00)86400-6
. [all data]
Dimov and Papazova, 1979
Dimov, N.; Papazova, D.,
Calculation of retention indices of isoparaffins on different phases,
Chromatographia, 1979, 12, 7, 443-447, https://doi.org/10.1007/BF02302987
. [all data]
Nabivach and Kirilenko, 1979
Nabivach, V.M.; Kirilenko, A.V.,
The use of retention indices for identifying the components of crude benzene,
Solid Fuel Chem. (Engl. Transl.), 1979, 13, 3, 82-87. [all data]
Chretien and Dubois, 1976
Chretien, J.R.; Dubois, J.-E.,
New Perspectives in the Prediction of Kovats Indices,
J. Chromatogr., 1976, 126, 171-189, https://doi.org/10.1016/S0021-9673(01)84071-1
. [all data]
Lulova, Leont'eva, et al., 1976
Lulova, N.I.; Leont'eva, S.A.; Timofeeva, A.N.,
Gas-chromatographic method of determination of individual hydrocarbons in catalytic cracking gasolines
in Proceedings of All-Union Research Institute on Oil Processes. Vol.18, All-Union Research Institute on Oil Processes, Moscow, 1976, 30-53. [all data]
Ryba, 1976
Ryba, M.,
Unlösliche Restfilme er stationären Flüssigkeit in gas-chromatographischen Glaskapillaren,
Chromatographia, 1976, 9, 3, 105-112, https://doi.org/10.1007/BF02330376
. [all data]
Rijks and Cramers, 1974
Rijks, J.A.; Cramers, C.A.,
High precision capillary gas chromatography of hydrocarbons,
Chromatographia, 1974, 7, 3, 99-106, https://doi.org/10.1007/BF02269819
. [all data]
Gäumann and Bonzo, 1973
Gäumann, T.; Bonzo, R.,
The gas-chromatographic retention indices of deuterated compounds,
Helv. Chim. Acta, 1973, 56, 3, 1165-1176, https://doi.org/10.1002/hlca.19730560340
. [all data]
Pacáková, Hoch, et al., 1973
Pacáková, V.; Hoch, K.; Smolková, E.,
The Effect of Instrumentation on the Precision of Retention Indexes,
Chromatographia, 1973, 6, 7, 320-324, https://doi.org/10.1007/BF02269334
. [all data]
Sidorov, Petrova, et al., 1972
Sidorov, R.I.; Petrova, V.I.; Ivanova, M.P.,
Qualitative analysis of wide-boiling fraction C5-C10 with capillary chromatography
in Processes in chromatographic columns. Vol.17, 1972, 14-25. [all data]
Dimov and Schopov, 1971
Dimov, N.; Schopov, D.,
Empirische korrektion der physikalisch-chemischen retentionsindexe von kohlenwasserstoffen auf squalan,
J. Chromatogr., 1971, 63, 223-228, https://doi.org/10.1016/S0021-9673(01)85634-X
. [all data]
Robinson and Odell, 1971
Robinson, P.G.; Odell, A.L.,
A system of standard retention indices and its uses. The characterisation of stationary phases and the prediction of retention indices,
J. Chromatogr., 1971, 57, 1-10, https://doi.org/10.1016/0021-9673(71)80001-8
. [all data]
Takács, Szita, et al., 1971
Takács, J.; Szita, C.; Tarján, G.,
Contribution to the theory of the retention index system. III. Retention index and molecular structure. Calculation of retention indices of paraffin hydrocarbons on the basis of their molecular structure,
J. Chromatogr., 1971, 56, 1-12, https://doi.org/10.1016/S0021-9673(00)97771-9
. [all data]
Mitra and Saha, 1970
Mitra, G.D.; Saha, N.C.,
Determination of Retention Indices of Saturated Hydrocarbons by Graphical Methods,
J. Chromatogr. Sci., 1970, 8, 2, 95-102, https://doi.org/10.1093/chromsci/8.2.95
. [all data]
Matukuma, 1969
Matukuma, A.,
Retention indices of alkanes through C10 and alkenes through C8 and relation between boiling points and retention data,
Gas Chromatogr., Int. Symp. Anal. Instrum. Div Instrum Soc. Amer., 1969, 7, 55-75. [all data]
Hively and Hinton, 1968
Hively, R.A.; Hinton, R.E.,
Variation of the retention index with temperature on squalane substrates,
J. Gas Chromatogr., 1968, 6, 4, 203-217, https://doi.org/10.1093/chromsci/6.4.203
. [all data]
Tourres, 1967
Tourres, D.A.,
Structural analysis of industrial butene dimers by gas chromatography,
J. Gas Chromatogr., 1967, 5, 1, 35-40, https://doi.org/10.1093/chromsci/5.1.35
. [all data]
Tourres, 1967, 2
Tourres, D.A.,
Structure moléculaire et rétention en chromatographie en phase gazeuse. Influence de la température sur l'indice de rétention d'alcanes isomères,
J. Chromatogr., 1967, 30, 357-377, https://doi.org/10.1016/S0021-9673(00)84168-0
. [all data]
Evans, 1966
Evans, M.B.,
Retention indices of solutes on squalane, dinonyl phthalate, and polyethylene glycol 400,
J. Gas Chromatogr., 1966, 4, 1, 1-3, https://doi.org/10.1093/chromsci/4.1.1
. [all data]
Rembold, Wallner, et al., 1989
Rembold, H.; Wallner, P.; Nitz, S.; Kollmannsberger, H.; Drawert, F.,
Volatile components of chickpea (Cicer arietinum L.) seed,
J. Agric. Food Chem., 1989, 37, 3, 659-662, https://doi.org/10.1021/jf00087a018
. [all data]
Hayes and Pitzer, 1982
Hayes, P.C., Jr.; Pitzer, E.W.,
Characterizing petroleum- and shale-derived jet fuel distillates via temperature-programmed Kováts indices,
J. Chromatogr., 1982, 253, 179-198, https://doi.org/10.1016/S0021-9673(01)88376-X
. [all data]
Louis, 1971
Louis, R.,
Kovats-index-tafeln zur gaschromatographischen analyse von kohlenwasserstoffgemischen,
Erdoel Kohle Erdgas Petrochem., 1971, 24, 2, 88-94. [all data]
Haagen-Smit Laboratory, 1997
Haagen-Smit Laboratory,
Procedure for the detailed hydrocarbon analysis of gasolines by single column high efficiency (capillary) column gas chromatography, SOP NO. MLD 118, Revision No. 1.1, California Environmental Protection Agency, Air Resources Board, El Monte, California, 1997, 22. [all data]
Hoekman, 1993
Hoekman, S.K.,
Improved gas chromatography procedure for speciated hydrocarbon measurements of vehicle emissions,
J. Chromatogr., 1993, 639, 2, 239-253, https://doi.org/10.1016/0021-9673(93)80260-F
. [all data]
Engel and Ratel, 2007
Engel, E.; Ratel, J.,
Correction of the data generated by mass spectrometry analyses of biological tissues: Application to food authentication,
J. Chromatogr. A, 2007, 1154, 1-2, 331-341, https://doi.org/10.1016/j.chroma.2007.02.012
. [all data]
Insausti, Goñi, et al., 2005
Insausti, K.; Goñi, V.; Petri, E.; Gorraiz, C.; Beriain, M.J.,
Effect of weight at slaughter on the volatile compounds of cooked beef from Spanish cattle breeds,
Meat Sci., 2005, 70, 1, 83-90, https://doi.org/10.1016/j.meatsci.2004.12.003
. [all data]
Censullo, Jones, et al., 2003
Censullo, A.C.; Jones, D.R.; Wills, M.T.,
Speciation of the volatile organic compounds (VOCs) in solventborne aerosol coatings by solid phase microextraction-gas chromatography,
J. Coat. Technol., 2003, 75, 936, 47-53, https://doi.org/10.1007/BF02697922
. [all data]
LECO Corporation, 2003
LECO Corporation,
Determination of hydrocarbon components in petroleum naphthas, 2003, retrieved from http://www.leco.org/customersupport/apps/separationscience/-190.pdf. [all data]
Xu, van Stee, et al., 2003
Xu, X.; van Stee, L.L.P.; Williams, J.; Beens, J.; Adahchour, M.; Vreuls, R.J.J.; Brinkman, U.A.Th.; Lelieveld, J.,
Comprehensive two-dimensional gas chromatography (GC×GC) measurements of volatile organic compounds in the atmosphere,
Atmos. Chem. Phys., 2003, 3, 3, 665-682, https://doi.org/10.5194/acp-3-665-2003
. [all data]
Yin, Liu, et al., 2001
Yin, C.; Liu, W.; Li, Z.; Pan, Z.; Lin, T.; Zhang, M.,
Chemometrics to chemical modeling: structural coding in hydrocarbons and retention indices of gas chromatography,
J. Sep. Sci., 2001, 24, 3, 213-220, https://doi.org/10.1002/1615-9314(20010301)24:3<213::AID-JSSC213>3.0.CO;2-4
. [all data]
Martos, Saraullo, et al., 1997
Martos, P.A.; Saraullo, A.; Pawliszyn, J.,
Estimation of air/coating distribution coefficients for solid phase microextraction using retention indexes from linear temperature-programmed capillary gas chromatography. Application to the sampling and analysis of total petroleum hydrocarbons in air,
Anal. Chem., 1997, 69, 3, 402-408, https://doi.org/10.1021/ac960633p
. [all data]
Subramaniam, Bochniak, et al., 1994
Subramaniam, B.; Bochniak, D.; Snavely, K.,
Fischer-Tropsch synthesis in supercritical reaction media, Lawrence Department of Chemical and Petroleum Engineering (DOE/PC/92532--T7), United States Department of Energy, Pittsburgh, PA, 1994, 8, retrieved from http://www.NTIS.gov. [all data]
Olson, Sinkevitch, et al., 1992
Olson, K.L.; Sinkevitch, R.M.; Sloane, T.M.,
Speciation and Quantitation of Hydrocarbons in Gasoline Engine Exhaust,
J. Chromatogr. Sci., 1992, 30, 12, 500-508, https://doi.org/10.1093/chromsci/30.12.500
. [all data]
White, Douglas, et al., 1992
White, C.M.; Douglas, L.J.; Hackett, J.P.; Anderson, R.R.,
Characterization of synthetic gasoline from the chloromethane-zeolite reaction,
Energy Fuels, 1992, 6, 1, 76-82, https://doi.org/10.1021/ef00031a012
. [all data]
White, Hackett, et al., 1992
White, C.M.; Hackett, J.; Anderson, R.R.; Kail, S.; Spock, P.S.,
Linear temperature programmed retention indices of gasoline range hydrocarbons and chlorinated hydrocarbons on cross-linked polydimethylsiloxane,
J. Hi. Res. Chromatogr., 1992, 15, 2, 105-120, https://doi.org/10.1002/jhrc.1240150211
. [all data]
Bangjie, Xijian, et al., 1987
Bangjie, C.; Xijian, G.; Shaoyi, P.,
Calculation of retention indices in temperature-programmed gas chromatography,
Chromatographia, 1987, 23, 12, 888-892, https://doi.org/10.1007/BF02261466
. [all data]
Haynes and Pitzer, 1985
Haynes, P.C., Jr.; Pitzer, E.W.,
Disengaging solutes in shale- and petroleum-derived jet fuels by altering GC programmed temperature rates,
J. Hi. Res. Chromatogr. Chromatogr. Comm., 1985, 8, 5, 230-242, https://doi.org/10.1002/jhrc.1240080504
. [all data]
Hayes and Pitzer, 1981
Hayes, P.C., Jr.; Pitzer, E.W.,
Kovats indices as a tool in characterizing hydrocarbon fuels in temperature programmed glass capillary gas chromatography. Part 1. Qualitative identification, Inhouse rpt. for Air Force Wright Aeronautical Labs., Air Force Wright Aeronautical Labs., Wright-Patterson AFB, Ohio, 1981, 75. [all data]
Zaikin and Borisov, 2002
Zaikin, V.G.; Borisov, R.S.,
Chromatographic-mass spectrometric analysis of Fishcer-Tropsch synthesis products,
J. Anal. Chem. USSR (Engl. Transl.), 2002, 57, 6, 544-551. [all data]
Hassoun, Pilling, et al., 1999
Hassoun, S.; Pilling, M.J.; Bartle, K.D.,
A catalogue of urban hydrocarbons for the city of Leeds: atmospheric monitoring of volatile organic compounds by thermal desorption-gas chromatography,
J. Environ. Monitor., 1999, 1, 5, 453-458, https://doi.org/10.1039/a904879k
. [all data]
Wu and Lu, 1984
Wu, J.; Lu, W.,
Hydrocarbon analysis by open-tubular column chromatography with programmed temperature for straight run gasoline,
Anal. Chem., 1984, 12, 7, 572-578. [all data]
Elmore, Nisyrios, et al., 2005
Elmore, J.S.; Nisyrios, I.; Mottram, D.S.,
Analysis of the headspace aroma compounds of walnuts (Juglans regia L.),
Flavour Fragr. J., 2005, 20, 5, 501-506, https://doi.org/10.1002/ffj.1477
. [all data]
Li and Deng, 1998
Li, H.; Deng, C.,
Qualitative analysis of light components of gasoline cracking using Kovats retention indices,
J. Instrumental Analysis, 1998, 17, 1, 67-69. [all data]
Wu and Lu, 1984, 2
Wu, J.; Lu, W.,
Kovats indices of C4-C10 hydrocarbons in apolar quartz capillary OV-101,
Chin. J. Chromatogr., 1984, 1, 1, 11-17. [all data]
Dimov N., 1976
Dimov N.,
Quantitative gas chromatographic analysis and determination of solute properties. An exact equation for the calculation of the retention indices of isoalkanes on Squalane,
J. Chromatogr., 1976, 119, 109-118, https://doi.org/10.1016/S0021-9673(00)86775-8
. [all data]
Vigdergauz and Martynov, 1971
Vigdergauz, M.S.; Martynov, A.A.,
Some applications of the gas chromatographic linear retention indices,
Chromatographia, 1971, 4, 10, 463-467, https://doi.org/10.1007/BF02268816
. [all data]
Bramston-Cook, 2013
Bramston-Cook, R.,
Kovats indices for C2-C13 hydrocarbons and selected oxygenated/halocarbons with 100 % dimethylpolysiloxane columns, 2013, retrieved from http://lotusinstruments.com/monographs/List .... [all data]
Supelco, 2012
Supelco, CatalogNo. 24160-U,
Petrocol DH Columns. Catalog No. 24160-U, 2012, retrieved from http://www.sigmaaldrich.com/etc/medialib/docs/Supelco/Datasheet/1/w97949.Par.0001.File.tmp/w97949.pdf. [all data]
Zhang, Ding, et al., 2009
Zhang, X.; Ding, L.; Sun, Z.; Song, L.; Sun, T.,
Study on quantitative structure-retention relationships for hydrocarbons in FCC gasoline,
Chromatographia, 2009, 70, 3/4, 511-518, https://doi.org/10.1365/s10337-009-1174-0
. [all data]
Krkosova, Kubinec, et al., 2007
Krkosova, Z.; Kubinec, R.; Addova, G.; Jurdakova, H.; Blasko, J.; Ostrovsky, I.; Sojak, L.,
Gas chromatographic - mass spectrometric characterization of monomethylalkanes from fuel diesel,
Petroleum Coal, 2007, 49, 3, 51-62. [all data]
Health Safety Executive, 2000
Health Safety Executive,
MDHS 96 Volatile organic compounds in air - Laboratory method using pumed solid sorbent tubes, solvent desorption and gas chromatography
in Methods for the Determination of Hazardous Substances (MDHS) guidance, Crown, Colegate, Norwich, 2000, 1-24, retrieved from http://www.hse.gov.uk/pubns/mdhs/pdfs/mdhs96.pdf. [all data]
Guan, Li, et al., 1995
Guan, Y.; Li, L.; Zhou, L.,
Live retention database for compound identification in capillary gas chromatography,
Chin. J. Chromatogr., 1995, 13, 5, 851-857. [all data]
Ciccioli, Cecinato, et al., 1992
Ciccioli, P.; Cecinato, A.; Brancaleoni, E.; Frattoni, M.; Liberti, A.,
Use of carbon adsorption traps combined with high resolution gas chromatography - mass spectrometry for the analysis of polar and non-polar C4-C14 hydrocarbons involved in photochemical smog formation,
J. Hi. Res. Chromatogr., 1992, 15, 2, 75-84, https://doi.org/10.1002/jhrc.1240150205
. [all data]
Zenkevich and Ventura, 1991
Zenkevich, I.G.; Ventura, K.,
Gas Chromatographic Identification of Volatile Products of Thermal Degradation of Bitumen,
Zh. Prikl. Khim. (Rus.), 1991, 9, 1974-1979. [all data]
Hackett, Gibbon, et al., 1985
Hackett, J.P.; Gibbon, G.A.; Feldman, J.A.,
Capillary Gas Chromatographic Characterization of Fischer-Tropsch Liquefaction Product Oils,
J. Chromatogr. Sci., 1985, 23, 7, 285-292, https://doi.org/10.1093/chromsci/23.7.285
. [all data]
Barra, Baldovini, et al., 2007
Barra, A.; Baldovini, N.; Loiseau, A.-M.; Albino, L.; Lesecq, C.; Cuvelier, L.L.,
Chemical analysis of French beans (Phaseolus vulgaris L.) by headspace solid phase microextraction (HS-SPME) and simultaneous distillation/extraction (SDE),
Food Chem., 2007, 101, 3, 1279-1284, https://doi.org/10.1016/j.foodchem.2005.12.027
. [all data]
Chen and Feng, 2007
Chen, Y.; Feng, C.,
QSPR study on gas chromatography retention index of some organic pollutants,
Comput. Appl. Chem. (China), 2007, 24, 10, 1404-1408. [all data]
Feng and Mu, 2007
Feng, H.; Mu, L.-L.,
Quantitative structure-retention relationships for alkane and its derivatives based on electrotopological state index and molecular shape index,
Chem. Ind. Engineering (Chinese), 2007, 24, 2, 161-168. [all data]
Blunden, Aneja, et al., 2005
Blunden, J.; Aneja, V.P.; Lonneman, W.A.,
Characterization of non-methane volatile organic compounds at swine facilities in eastern North Carolina,
Atm. Environ., 2005, 39, 36, 6707-6718, https://doi.org/10.1016/j.atmosenv.2005.03.053
. [all data]
Du and Liang, 2003
Du, Y.; Liang, Y.,
Data mining for seeking accurate quantitative relationship between molecular structure and GC retention indices of alkanes by projection pursuit,
Comput. Biol. Chem., 2003, 27, 3, 339-353, https://doi.org/10.1016/S1476-9271(02)00081-6
. [all data]
Junkes, Castanho, et al., 2003
Junkes, B.S.; Castanho, R.D.M.; Amboni, C.; Yunes, R.A.; Heinzen, V.E.F.,
Semiempirical Topological Index: A Novel Molecular Descriptor for Quantitative Structure-Retention Relationship Studies,
Internet Electronic Journal of Molecular Design, 2003, 2, 1, 33-49. [all data]
Cooke, Hassoun, et al., 2001
Cooke, K.M.; Hassoun, S.; Sanders, S.M.; Pilling, M.J.,
Identification and quantification of volatile organic compounds found in a eucalyptus forest during FIELDVOC'94 in Portugal,
Chemosphere Global Change Science, 2001, 3, 3, 249-257, https://doi.org/10.1016/S1465-9972(01)00008-3
. [all data]
Yin, Guo, et al., 2001
Yin, C.; Guo, W.; Lin, T.; Liu, S.; Fu, R.; Pan, Z.; Wang, L.,
Application of wavelet neural network to the prediction of gas chromatographic retention indices of alkanes,
J. Chinese Chem. Soc., 2001, 48, 739-749. [all data]
Zhu and Wang, 2001
Zhu, X.; Wang, W.,
The relationship between partition coefficients of hydrocarbons and their retention indices,
Acta Scientific Circumstantiae, 2001, 21, 5, 631-633. [all data]
Spieksma, 1999
Spieksma, W.,
Determination of vapor liquid equilibrium from the Kovats retention index on dimethylsilicone using the Wilson mixing tool,
J. Hi. Res. Chromatogr., 1999, 22, 10, 565-588, https://doi.org/10.1002/(SICI)1521-4168(19991001)22:10<565::AID-JHRC565>3.0.CO;2-2
. [all data]
Zhu and He, 1999
Zhu, X.; He, L.,
Derivation of isothermal retention indices from a retention values under multiple-ramp temperature-programmed conditions,
J. Instrum. Anal. (Chinese), 1999, 18, 6, 10-12. [all data]
Ciccioli, Cecinato, et al., 1994
Ciccioli, P.; Cecinato, A.; Brancaleoni, E.; Brachetti, A.; Frattoni, M.; Sparapani, R.,
Composition and Distribution of Polar and Non-Polar VOCs in Urban, Rural, Forest and Remote Areas,
Eur Commission EUR, 1994, 549-568. [all data]
Skrbic and Cvejanov, 1993
Skrbic, B.D.; Cvejanov, J.Dj.,
Correlation of unified retention indices for OV-101 and squalane,
Chromatographia, 1993, 35, 1/2, 109-110, https://doi.org/10.1007/BF02278566
. [all data]
Petrov, 1984
Petrov, A.A.,
Hydrocarbons of petroleum, Nauka (publishing house), Moscow, 1984, 263. [all data]
Waggott and Davies, 1984
Waggott, A.; Davies, I.W.,
Identification of organic pollutants using linear temperature programmed retention indices (LTPRIs) - Part II, 1984, retrieved from http://dwi.defra.gov.uk/research/completed-research/reports/dwi0383.pdf. [all data]
Robinson and Odell, 1971, 2
Robinson, P.G.; Odell, A.L.,
Comparison of isothermal and non-linear temperature programmed gas chromatography. The temperature dependence of the retention indices of a number of hydrocarbons on squalane and SE-30,
J. Chromatogr., 1971, 57, 11-17, https://doi.org/10.1016/0021-9673(71)80002-X
. [all data]
Galindo-Cuspinera, Lubran, et al., 2002
Galindo-Cuspinera, V.; Lubran, M.B.; Rankin, S.A.,
Comparison of volatile compounds in water- and oil-soluble annatto (Bixa orellana L.) extracts,
J. Agric. Food Chem., 2002, 50, 7, 2010-2015, https://doi.org/10.1021/jf011325h
. [all data]