2,3-Pentadiene
- Formula: C5H8
- Molecular weight: 68.1170
- IUPAC Standard InChIKey: PODAMDNJNMAKAZ-UHFFFAOYSA-N
- CAS Registry Number: 591-96-8
- Chemical structure:
View 3d structure (requires JavaScript / HTML 5) - Other names: 1,3-Dimethylallene; CH3CH=C=CHCH3

Gas phase thermochemistry data

Data compiled as indicated in comments:
ALS - Hussein Y. Afeefy, Joel F. Liebman, and Stephen E. Stein
GT - Glushko Thermocenter, Russian Academy of Sciences, Moscow
Quantity | Value | Units | Method | Reference | Comment |
---|---|---|---|---|---|
ΔfH°gas | 133.0 ± 0.71 | kJ/mol | Cm | Fraser and Prosen, 1955 | ALS |
Quantity | Value | Units | Method | Reference | Comment |
ΔcH°gas | -3243.9 ± 0.67 | kJ/mol | Cm | Fraser and Prosen, 1955 | Corresponding ΔfHºgas = 133.1 kJ/mol (simple calculation by NIST; no Washburn corrections); ALS |
Quantity | Value | Units | Method | Reference | Comment |
S°gas | 329.11 | J/mol*K | N/A | Messerly J.F., 1970 | GT |
Constant pressure heat capacity of gas
Cp,gas (J/mol*K) | Temperature (K) | Reference | Comment |
---|---|---|---|
38.3 | 50. | Thermodynamics Research Center, 1997 | GT |
55.3 | 100. | ||
68.0 | 150. | ||
78.7 | 200. | ||
94.3 | 273.15 | ||
99.9 | 298.15 | ||
100.3 | 300. | ||
123.20 | 400. | ||
144.5 | 500. | ||
163.0 | 600. | ||
179.4 | 700. | ||
193. | 800. | ||
206. | 900. | ||
216. | 1000. | ||
225. | 1100. | ||
233. | 1200. | ||
240. | 1300. | ||
246. | 1400. | ||
251. | 1500. |

Condensed phase thermochemistry data

Data compiled by: Eugene S. Domalski and Elizabeth D. Hearing
Quantity | Value | Units | Method | Reference | Comment |
---|---|---|---|---|---|
S°liquid | 237.32 | J/mol*K | N/A | Messerly, Todd, et al., 1970 |
Constant pressure heat capacity of liquid
Cp,liquid (J/mol*K) | Temperature (K) | Reference | Comment |
---|---|---|---|
152.34 | 298.15 | Messerly, Todd, et al., 1970 | T = 12 to 320 K. |

Phase change data

Data compiled as indicated in comments:
TRC - Thermodynamics Research Center, NIST Boulder Laboratories, Chris Muzny director
AC - William E. Acree, Jr., James S. Chickos
DH - Eugene S. Domalski and Elizabeth D. Hearing
Quantity | Value | Units | Method | Reference | Comment |
---|---|---|---|---|---|
Tboil | 321.35 | K | N/A | Pomerantz, Fookson, et al., 1954 | Uncertainty assigned by TRC = 0.4 K; TRC |
Quantity | Value | Units | Method | Reference | Comment |
Tfus | 147.43 | K | N/A | Pomerantz, Fookson, et al., 1954, 2 | Uncertainty assigned by TRC = 0.06 K; TRC |
Tfus | 147.43 | K | N/A | Pomerantz, Fookson, et al., 1954 | Uncertainty assigned by TRC = 0.2 K; TRC |
Tfus | 147.460 | K | N/A | Streiff, Soule, et al., 1950 | Uncertainty assigned by TRC = 0.05 K; TRC |
Tfus | 147.470 | K | N/A | Streiff, Soule, et al., 1950 | Uncertainty assigned by TRC = 0.04 K; TRC |
Tfus | 147.500 | K | N/A | Streiff, Soule, et al., 1950 | Uncertainty assigned by TRC = 0.02 K; TRC |
Quantity | Value | Units | Method | Reference | Comment |
Ttriple | 147.52 | K | N/A | Messerly, Todd, et al., 1970, 2 | Uncertainty assigned by TRC = 0.05 K; TRC |
Quantity | Value | Units | Method | Reference | Comment |
ΔvapH° | 29.5 | kJ/mol | N/A | Reid, 1972 | AC |
Enthalpy of vaporization
ΔvapH (kJ/mol) | Temperature (K) | Method | Reference | Comment |
---|---|---|---|---|
32.3 | 246. | A | Stephenson and Malanowski, 1987 | Based on data from 234. to 258. K.; AC |
31.1 | 273. | A | Stephenson and Malanowski, 1987 | Based on data from 258. to 330. K.; AC |
33.2 | 232. | IP | Osborn and Douslin, 1969 | Based on data from 213. to 247. K.; AC |
29.6 | 310. | MM | Forziati, Camin, et al., 1950 | Based on data from 298. to 322. K.; AC |
Antoine Equation Parameters
log10(P) = A − (B / (T + C))
P = vapor pressure (bar)
T = temperature (K)
View plot Requires a JavaScript / HTML 5 canvas capable browser.
Temperature (K) | A | B | C | Reference | Comment |
---|---|---|---|---|---|
213.14 to 247.10 | 4.38779 | 1256.175 | -33.585 | Osborn and Douslin, 1969 | Coefficents calculated by NIST from author's data. |
Enthalpy of fusion
ΔfusH (kJ/mol) | Temperature (K) | Reference | Comment |
---|---|---|---|
6.1279 | 147.52 | Messerly, Todd, et al., 1970 | DH |
6.13 | 147.5 | Domalski and Hearing, 1996 | AC |
Entropy of fusion
ΔfusS (J/mol*K) | Temperature (K) | Reference | Comment |
---|---|---|---|
44.929 | 147.52 | Messerly, Todd, et al., 1970 | DH |

Gas phase ion energetics data

Data compiled as indicated in comments:
LLK - Sharon G. Lias, Rhoda D. Levin, and Sherif A. Kafafi
RDSH - Henry M. Rosenstock, Keith Draxl, Bruce W. Steiner, and John T. Herron
Ionization energy determinations
IE (eV) | Method | Reference | Comment |
---|---|---|---|
9.13 ± 0.02 | PE | Bieri, Burger, et al., 1977 | LLK |
9.26 | EI | Collin and Lossing, 1959 | RDSH |
9.13 | PE | Brogli, Crandall, et al., 1973 | Vertical value; LLK |

Kovats' RI, non-polar column, isothermal

Column type | Active phase | Temperature (C) | I | Reference | Comment |
---|---|---|---|---|---|
Capillary | OV-1 | 27. | 531. | Heberger, 1990 | 25. m/0.25 mm/0.50 μm, He |
Capillary | Squalane | 50. | 530. | Mitra, 1981 | N2; Column length: 100. m; Column diameter: 0.25 mm |
Capillary | Squalane | 50. | 530. | Mitra, 1981 | N2; Column length: 100. m; Column diameter: 0.25 mm |
Capillary | Squalane | 50. | 531.1 | Bajus, Veselý, et al., 1979 | Column length: 100. m; Column diameter: 0.25 mm |
Capillary | Squalane | 50. | 530. | Rijks and Cramers, 1974 | N2; Column length: 100. m; Column diameter: 0.25 mm |
Capillary | Squalane | 70. | 530. | Rijks and Cramers, 1974 | N2; Column length: 100. m; Column diameter: 0.25 mm |
Packed | Squalane | 27. | 532. | Hively and Hinton, 1968 | He, Chromosorb P; Column length: 15. m; Column diameter: 0.25 mm |
Packed | Squalane | 49. | 531. | Hively and Hinton, 1968 | He, Chromosorb P; Column length: 15. m; Column diameter: 0.25 mm |
Packed | Squalane | 67. | 531. | Hively and Hinton, 1968 | He, Chromosorb P; Column length: 15. m; Column diameter: 0.25 mm |
Packed | Squalane | 86. | 530. | Hively and Hinton, 1968 | He, Chromosorb P; Column length: 15. m; Column diameter: 0.25 mm |
Packed | Squalane | 26. | 539. | Zulaïca and Guiochon, 1966 | Column length: 10. m |

Van Den Dool and Kratz RI, non-polar column, temperature ramp

Column type | Active phase | I | Reference | Comment |
---|---|---|---|---|
Capillary | Petrocol DH | 544. | White, Hackett, et al., 1992 | 100. m/0.25 mm/0.5 μm, He, 1. K/min; Tstart: 30. C; Tend: 220. C |

Normal alkane RI, non-polar column, temperature ramp

Column type | Active phase | I | Reference | Comment |
---|---|---|---|---|
Capillary | Petrocol DH | 556. | Supelco, 2012 | 100. m/0.25 mm/0.50 μm, Helium, 20. C @ 15. min, 15. K/min, 220. C @ 30. min |

References

Fraser and Prosen, 1955
Fraser, F.M.; Prosen, E.J.,
Heats of combustion and isomerization of six pentadienes and spiropentane,
J. Res. NBS, 1955, 54, 143-148. [all data]
Messerly J.F., 1970
Messerly J.F.,
Chemical thermodynamic properties of the pentadienes. Third law studies,
J. Chem. Eng. Data, 1970, 15, 227-232. [all data]
Thermodynamics Research Center, 1997
Thermodynamics Research Center,
Selected Values of Properties of Chemical Compounds., Thermodynamics Research Center, Texas A&M University, College Station, Texas, 1997. [all data]
Messerly, Todd, et al., 1970
Messerly, J.F.; Todd, S.S.; Guthrie, G.B.,
Chemical thermodynamic properties of the pentadienes,
J. Chem. Eng. Data, 1970, 15, 227-232. [all data]
Pomerantz, Fookson, et al., 1954
Pomerantz, P.; Fookson, A.; Mears, T.W.; Rothberg, S.; Howard, F.L.,
Synth. and Phys. Prop. of Several Aliphatic and Alicyclic Hydrocarbons hydrocarbons,
J. Res. Natl. Bur. Stand. (U. S.), 1954, 52, 59-65. [all data]
Pomerantz, Fookson, et al., 1954, 2
Pomerantz, P.; Fookson, A.; Mears, T.W.; Rothberg, S.; Howard, F.L.,
Synthesis and Physical Properties of Several Acetylenic Hydrocarbons,
J. Res. Natl. Bur. Stand. (U. S.), 1954, 52, 51. [all data]
Streiff, Soule, et al., 1950
Streiff, A.J.; Soule, L.F.; Kennedy, C.M.; Janes, M.E.; Sedlak, V.A.; Willingham, C.B.; Rossini, F.D.,
Purification, purity, and freezing points of twenty-nine hydrocarbons of the API-standard and API-NBS series.,
J. Res. Natl. Bur. Stand. (U. S.), 1950, 45, 173. [all data]
Messerly, Todd, et al., 1970, 2
Messerly, J.F.; Todd, S.S.; Guthrie, G.B.,
Chemical thermodynamic properties of the pentadienes. Third law studies.,
J. Chem. Eng. Data, 1970, 15, 227-32. [all data]
Reid, 1972
Reid, Robert C.,
Handbook on vapor pressure and heats of vaporization of hydrocarbons and related compounds, R. C. Wilhort and B. J. Zwolinski, Texas A Research Foundation. College Station, Texas(1971). 329 pages.$10.00,
AIChE J., 1972, 18, 6, 1278-1278, https://doi.org/10.1002/aic.690180637
. [all data]
Stephenson and Malanowski, 1987
Stephenson, Richard M.; Malanowski, Stanislaw,
Handbook of the Thermodynamics of Organic Compounds, 1987, https://doi.org/10.1007/978-94-009-3173-2
. [all data]
Osborn and Douslin, 1969
Osborn, Ann G.; Douslin, Donald R.,
Vapor pressure relations for the seven pentadienes,
J. Chem. Eng. Data, 1969, 14, 2, 208-209, https://doi.org/10.1021/je60041a010
. [all data]
Forziati, Camin, et al., 1950
Forziati, A.F.; Camin, D.L.; Rossini, F.D.,
Density, refractive index, boiling point, and vapor pressure of eight monoolefin (1-alkene), six pentadiene, and two cyclomonoolefin hydrocarbons,
J. RES. NATL. BUR. STAN., 1950, 45, 5, 406, https://doi.org/10.6028/jres.045.044
. [all data]
Domalski and Hearing, 1996
Domalski, Eugene S.; Hearing, Elizabeth D.,
Heat Capacities and Entropies of Organic Compounds in the Condensed Phase. Volume III,
J. Phys. Chem. Ref. Data, 1996, 25, 1, 1, https://doi.org/10.1063/1.555985
. [all data]
Bieri, Burger, et al., 1977
Bieri, G.; Burger, F.; Heilbronner, E.; Maier, J.P.,
Valence ionization enrgies of hydrocarbons,
Helv. Chim. Acta, 1977, 60, 2213. [all data]
Collin and Lossing, 1959
Collin, J.; Lossing, F.P.,
Ionization potentials of some olefins, di-olefins and branched paraffins,
J. Am. Chem. Soc., 1959, 81, 2064. [all data]
Brogli, Crandall, et al., 1973
Brogli, F.; Crandall, J.K.; Heilbronner, E.; Kloster-Jensen, E.; Sojka, S.A.,
The photoelectron spectra of methyl-substituted allenes and of tetramethyl-bisallenyl,
J. Electron Spectrosc. Relat. Phenom., 1973, 2, 455. [all data]