Allyl acetate
- Formula: C5H8O2
- Molecular weight: 100.1158
- IUPAC Standard InChIKey: FWZUNOYOVVKUNF-UHFFFAOYSA-N
- CAS Registry Number: 591-87-7
- Chemical structure:
View 3d structure (requires JavaScript / HTML 5) - Other names: Acetic acid, 2-propenyl ester; Acetic acid, allyl ester; 3-Acetoxypropene; CH2=C(CH3)OC(=O)CH3; 2-Propenyl acetate; 2-Propenyl ethanoate; UN 2333; 2-Propenyl ester of acetic acid; 3-Acetoxy-1-propene; Acetic acid, 2-propen-1-yl ester; NSC 7612

Gas phase thermochemistry data

Data compiled by: Glushko Thermocenter, Russian Academy of Sciences, Moscow
Constant pressure heat capacity of gas
Cp,gas (J/mol*K) | Temperature (K) | Reference | Comment |
---|---|---|---|
55.61 | 100. | Singh B., 1980 | |
83.60 | 200. | ||
109.04 | 273.15 | ||
118.07 | 298.15 | ||
118.74 | 300. | ||
152.59 | 400. | ||
181.25 | 500. | ||
204.68 | 600. | ||
223.97 | 700. | ||
240.08 | 800. | ||
253.68 | 900. | ||
265.31 | 1000. | ||
275.22 | 1100. | ||
283.76 | 1200. | ||
291.12 | 1300. | ||
297.52 | 1400. | ||
303.05 | 1500. |

Condensed phase thermochemistry data

Data compiled by: Eugene S. Domalski and Elizabeth D. Hearing
Constant pressure heat capacity of liquid
Cp,liquid (J/mol*K) | Temperature (K) | Reference | Comment |
---|---|---|---|
184.1 | 298. | von Reis, 1881 | T = 292 to 382 K. |

Phase change data

Data compiled as indicated in comments:
BS - Robert L. Brown and Stephen E. Stein
TRC - Thermodynamics Research Center, NIST Boulder Laboratories, Chris Muzny director
Quantity | Value | Units | Method | Reference | Comment |
---|---|---|---|---|---|
Tboil | 376.7 | K | N/A | Weast and Grasselli, 1989 | BS |
Tboil | 378. | K | N/A | American Tokyo Kasei, 1988 | BS |
Tboil | 377.7 | K | N/A | Von Reis, 1881 | Uncertainty assigned by TRC = 1. K; TRC |

Gas phase ion energetics data

Data compiled as indicated in comments:
LLK - Sharon G. Lias, Rhoda D. Levin, and Sherif A. Kafafi
LBLHLM - Sharon G. Lias, John E. Bartmess, Joel F. Liebman, John L. Holmes, Rhoda D. Levin, and W. Gary Mallard
Ionization energy determinations
IE (eV) | Method | Reference | Comment |
---|---|---|---|
9.8 | PE | Van Dam and Oskam, 1978 | LLK |
9.81 | PE | Van Dam and Oskam, 1978 | Vertical value; LLK |
9.74 ± 0.05 | PE | Houk and Munchausen, 1976 | Vertical value; LLK |
Appearance energy determinations
Ion | AE (eV) | Other Products | Method | Reference | Comment |
---|---|---|---|---|---|
C2H3O+ | 9.88 ± 0.05 | C3H5O | EI | Holmes and Lossing, 1986 | LBLHLM |

Kovats' RI, non-polar column, isothermal

View large format table.

Column type Active phase Temperature (C) I Reference Comment
PackedSE-30150.670.Allen and Haken, 1970Celite 560 silanized; Column length: 3.7 m

Van Den Dool and Kratz RI, non-polar column, temperature ramp

View large format table.

Column type Active phase I Reference Comment
CapillaryZB-1680.Herbrand K., Hammerschmidt F.J., et al., 200760. m/0.25 mm/0.25 μm, He, 3. K/min; Tstart: 60. C; Tend: 280. C
CapillarySE-30658.Korhonen, 1984N2, 6. K/min; Column length: 25. m; Column diameter: 0.30 mm; Tstart: 50. C

Van Den Dool and Kratz RI, polar column, temperature ramp

View large format table.

Column type Active phase I Reference Comment
CapillaryZB-Wax1023.Herbrand K., Hammerschmidt F.J., et al., 200760. m/0.32 mm/0.25 μm, He, 3. K/min; Tstart: 60. C; Tend: 240. C
CapillaryOV-3511014.Korhonen, 1984N2, 6. K/min; Column length: 25. m; Column diameter: 0.32 mm; Tstart: 50. C

Normal alkane RI, non-polar column, temperature ramp

View large format table.

Column type Active phase I Reference Comment
CapillaryOV-101681.Zenkevich, 200525. m/0.20 mm/0.10 μm, N2/He, 6. K/min; Tstart: 50. C; Tend: 250. C

Normal alkane RI, non-polar column, custom temperature program

View large format table.

Column type Active phase I Reference Comment
CapillarySE-30675.Vinogradov, 2004Program: not specified
CapillaryOV-101675.Shibamoto, 1987Program: not specified
CapillaryOV-1, SE-30, Methyl silicone, SP-2100, OV-101, DB-1, etc.656.Waggott and Davies, 1984Hydrogen; Column length: 50. m; Column diameter: 0.32 mm; Program: not specified
CapillaryOV-1, SE-30, Methyl silicone, SP-2100, OV-101, DB-1, etc.670.Waggott and Davies, 1984Hydrogen; Column length: 50. m; Column diameter: 0.32 mm; Program: not specified

Normal alkane RI, polar column, custom temperature program

View large format table.

Column type Active phase I Reference Comment
CapillaryCarbowax 20M1010.Vinogradov, 2004Program: not specified
CapillaryCarbowax 20M1010.Shibamoto, 1987Program: not specified
CapillaryCarbowax 400, Carbowax 20M, Carbowax 1540, Carbowax 4000, Superox 06, PEG 20M, etc.1025.Waggott and Davies, 1984Hydrogen; Column length: 50. m; Column diameter: 0.32 mm; Program: not specified

References

Singh B., 1980
Singh B.,
Vibrational spectra and thermodynamic functions of allyl acetate,
Proc. Indian Acad. Sci., Chem. Sci., 1980, 89, 201-207. [all data]
von Reis, 1881
von Reis, M.A.,
Die specifische Wärme flüssiger organischer Verbindungen und ihre Beziehung zu deren Moleculargewicht,
Ann. Physik [3], 1881, 13, 447-464. [all data]
Weast and Grasselli, 1989
CRC Handbook of Data on Organic Compounds, 2nd Editon, Weast,R.C and Grasselli, J.G., ed(s)., CRC Press, Inc., Boca Raton, FL, 1989, 1. [all data]
American Tokyo Kasei, 1988
American Tokyo Kasei,
TCI American Organic Chemical 88/89 Catalog, American Tokyo Kasei, Portland, OR, 1988, 1610. [all data]
Von Reis, 1881
Von Reis, M.A.,
IV. The Specific Heat of Liquid Organic Compounds and its Relation to Molecular Weight.,
Ann. Phys. (Leipzig), 1881, 13, 447. [all data]
Van Dam and Oskam, 1978
Van Dam, H.; Oskam, A.,
He(I) and He(II) photoelectron spectra of some substituted ethylenes,
J. Electron Spectrosc. Relat. Phenom., 1978, 13, 273. [all data]
Houk and Munchausen, 1976
Houk, K.N.; Munchausen, L.L.,
Ionization potentials, electron affinities, reactivities of cyanoalkenes related electron-deficient alkenes. A frontier molecular orbital treatment of cyanoalkene reactivities in cycloaddition, electrophilic, nucleophilic, and radical reactions.,
J. Am. Chem. Soc., 1976, 98, 937. [all data]
Holmes and Lossing, 1986
Holmes, J.L.; Lossing, F.P.,
Heats of formation and homolytic bond dissociation energies in the keto-enol tautomers C2H4O, C3H6O,
J. Am. Chem. Soc., 1986, 108, 1086. [all data]