2-Oxabicyclo[3.2.1]oct-3-ene
- Formula: C7H10O
- Molecular weight: 110.1537
- IUPAC Standard InChIKey: QPGUWJPTCPGNMB-UHFFFAOYSA-N
- CAS Registry Number: 59171-38-9
- Chemical structure:
View 3d structure (requires JavaScript / HTML 5) - Permanent link for this species. Use this link for bookmarking this species for future reference.

Gas phase ion energetics data

Data compiled by: Sharon G. Lias, Rhoda D. Levin, and Sherif A. Kafafi
Ionization energy determinations
IE (eV) | Method | Reference | Comment |
---|---|---|---|
8.01 | PE | Barraclough, Bilgic, et al., 1979 | Vertical value |

References

Barraclough, Bilgic, et al., 1979
Barraclough, P.; Bilgic, S.; Pedley, J.B.; Rogers, A.J.; Young, D.W.,
Conjugative and homoconjugative effects in 2-heterobicyclo[3.2.1]octa-3,6-dienes,
Tetrahedron, 1979, 35, 99. [all data]