Benzene, iodo-
- Formula: C6H5I
- Molecular weight: 204.0084
- IUPAC Standard InChIKey: SNHMUERNLJLMHN-UHFFFAOYSA-N
- CAS Registry Number: 591-50-4
- Chemical structure:
View 3d structure (requires JavaScript / HTML 5) - Other names: Benzene iodide; Iodobenzene; Phenyl iodide

Gas phase thermochemistry data

Data compiled by: Hussein Y. Afeefy, Joel F. Liebman, and Stephen E. Stein
Quantity | Value | Units | Method | Reference | Comment |
---|---|---|---|---|---|
ΔfH°gas | 165. ± 5.9 | kJ/mol | Ccb | Smith, 1956 | Heat of formation derived by Cox and Pilcher, 1970 |

Condensed phase thermochemistry data

Data compiled as indicated in comments:
ALS - Hussein Y. Afeefy, Joel F. Liebman, and Stephen E. Stein
DH - Eugene S. Domalski and Elizabeth D. Hearing
Quantity | Value | Units | Method | Reference | Comment |
---|---|---|---|---|---|
ΔfH°liquid | 117. ± 4.2 | kJ/mol | Ccb | Smith, 1956 | Heat of formation derived by Cox and Pilcher, 1970; ALS |
Quantity | Value | Units | Method | Reference | Comment |
ΔcH°liquid | -3192.8 ± 4.2 | kJ/mol | Ccb | Smith, 1956 | Reanalyzed by Cox and Pilcher, 1970, Original value = -3190.0 kJ/mol; Heat of formation derived by Cox and Pilcher, 1970; ALS |
ΔcH°liquid | -3192.8 ± 4.2 | kJ/mol | Ccb | Smith, 1956 | Reanalyzed by Cox and Pilcher, 1970, Original value = -3190.0 kJ/mol; ALS |
Quantity | Value | Units | Method | Reference | Comment |
S°liquid | 205.4 | J/mol*K | N/A | Stull, 1937 | Extrapolation below 91 K, 53.14 J/mol*K.; DH |
Constant pressure heat capacity of liquid
Cp,liquid (J/mol*K) | Temperature (K) | Reference | Comment |
---|---|---|---|
158.4 | 298.15 | Shehatta, 1993 | DH |
158.70 | 298.1 | Stull, 1937 | T = 90 to 320 K.; DH |
Constant pressure heat capacity of solid
Cp,solid (J/mol*K) | Temperature (K) | Reference | Comment |
---|---|---|---|
112.1 | 226.1 | Aoyama and Kanda, 1935 | T = 81 to 226 K. Value is unsmoothed experimental datum.; DH |

Gas phase ion energetics data

Data evaluated as indicated in comments:
L - Sharon G. Lias
Data compiled as indicated in comments:
LBLHLM - Sharon G. Lias, John E. Bartmess, Joel F. Liebman, John L. Holmes, Rhoda D. Levin, and W. Gary Mallard
LLK - Sharon G. Lias, Rhoda D. Levin, and Sherif A. Kafafi
RDSH - Henry M. Rosenstock, Keith Draxl, Bruce W. Steiner, and John T. Herron
Quantity | Value | Units | Method | Reference | Comment |
---|---|---|---|---|---|
IE (evaluated) | 8.72 ± 0.04 | eV | N/A | N/A | L |
Ionization energy determinations
IE (eV) | Method | Reference | Comment |
---|---|---|---|
8.79 | PE | Fujisawa, Ohno, et al., 1986 | LBLHLM |
8.75 | PE | Klasinc, Kovac, et al., 1983 | LBLHLM |
8.685 | PIPECO | Dannacher, Rosenstock, et al., 1983 | LBLHLM |
8.79 | PE | Kimura, Katsumata, et al., 1981 | LLK |
8.70 | PE | Behan, Johnstone, et al., 1976 | LLK |
9.05 | EI | Baldwin, Loudon, et al., 1976 | LLK |
8.77 ± 0.02 | PIPECO | Baer, Tsai, et al., 1976 | LLK |
8.67 | PE | Boschi and Salahub, 1974 | LLK |
8.73 ± 0.01 | PI | Sergeev, Akopyan, et al., 1970 | RDSH |
8.685 | PI | Momigny, Goffart, et al., 1968 | RDSH |
8.73 ± 0.03 | PI | Watanabe, 1957 | RDSH |
8.801 | PE | Potts, Lyus, et al., 1980 | Vertical value; LLK |
8.67 | PE | Sell and Kupperman, 1978 | Vertical value; LLK |
Appearance energy determinations
Ion | AE (eV) | Other Products | Method | Reference | Comment |
---|---|---|---|---|---|
C6H5+ | 11.07 ± 0.07 | I | PI | Malinovich and Lifshitz, 1986 | LBLHLM |
C6H5+ | 10.6 ± 0.1 | I | TRPI | Lifshitz and Malinovich, 1984 | LBLHLM |
C6H5+ | 10.55 ± 0.01 | I | EI | Gefen and Lifshitz, 1984 | LBLHLM |
C6H5+ | 11.2 ± 0.9 | I | PI | Dunbar and Honovich, 1984 | LBLHLM |
C6H5+ | 11.32 ± 0.05 | I | EI | Burgers and Holmes, 1984 | LBLHLM |
C6H5+ | 11.4 ± 0.1 | I | EI | Burgers and Holmes, 1984 | LBLHLM |
C6H5+ | 11.015 | I | PIPECO | Dannacher, Rosenstock, et al., 1983 | LBLHLM |
C6H5+ | 11.4 ± 0.1 | I | EI | Burgers and Holmes, 1982 | LBLHLM |
C6H5+ | 11.27 | I | PIPECO | Baer, Tsai, et al., 1976 | LLK |
C6H5+ | 11.34 | I | EI | Johnstone and Mellon, 1972 | LLK |
C6H5+ | 11.06 ± 0.04 | I | PI | Sergeev, Akopyan, et al., 1970 | RDSH |
C6H5+ | 11.46 | I | EI | Howe and Williams, 1969 | RDSH |

Phase change data

Data compiled as indicated in comments:
BS - Robert L. Brown and Stephen E. Stein
TRC - Thermodynamics Research Center, NIST Boulder Laboratories, Chris Muzny director
AC - William E. Acree, Jr., James S. Chickos
ALS - Hussein Y. Afeefy, Joel F. Liebman, and Stephen E. Stein
DH - Eugene S. Domalski and Elizabeth D. Hearing
Quantity | Value | Units | Method | Reference | Comment |
---|---|---|---|---|---|
Tboil | 461.4 ± 0.6 | K | AVG | N/A | Average of 6 values; Individual data points |
Quantity | Value | Units | Method | Reference | Comment |
Tfus | 242.15 | K | N/A | Mallikarjun and Hill, 1965 | Uncertainty assigned by TRC = 1. K; TRC |
Tfus | 241.9 | K | N/A | Dreisbach, 1955 | Uncertainty assigned by TRC = 0.02 K; TRC |
Tfus | 241.8 | K | N/A | Timmermans, 1952 | Uncertainty assigned by TRC = 0.3 K; TRC |
Quantity | Value | Units | Method | Reference | Comment |
Ttriple | 241.8 | K | N/A | Stull, 1937, 2 | Uncertainty assigned by TRC = 0.25 K; TRC |
Quantity | Value | Units | Method | Reference | Comment |
ΔvapH° | 11.3 | kcal/mol | CGC | Chickos, Hosseini, et al., 1995 | Based on data from 313. to 353. K.; AC |
ΔvapH° | 11.7 | kcal/mol | N/A | Boublik, Fried, et al., 1984 | Based on data from 320. to 460. K. See also Basarová and Svoboda, 1991.; AC |
ΔvapH° | 11.4 ± 1.0 | kcal/mol | V | Smith, 1956 | Heat of formation derived by Cox and Pilcher, 1970; ALS |
Enthalpy of vaporization
ΔvapH (kcal/mol) | Temperature (K) | Method | Reference | Comment |
---|---|---|---|---|
9.82 | 477. | A | Stephenson and Malanowski, 1987 | Based on data from 462. to 679. K.; AC |
12.3 | 288. | A | Stephenson and Malanowski, 1987 | Based on data from 273. to 358. K. See also Dykyj, 1972.; AC |
11.0 | 373. | A | Stephenson and Malanowski, 1987 | Based on data from 358. to 543. K. See also Dykyj, 1972.; AC |
10.3 | 243. to 255. | N/A | Jones, 1960 | AC |
9.56 | 275. | ME | Zibberman-Granovskaya, 1940 | Based on data from 248. to 303. K.; AC |
Antoine Equation Parameters
log10(P) = A − (B / (T + C))
P = vapor pressure (atm)
T = temperature (K)
View plot Requires a JavaScript / HTML 5 canvas capable browser.
Temperature (K) | A | B | C | Reference | Comment |
---|---|---|---|---|---|
302.4 to 461.4 | 4.3655 | 1803.466 | -47.933 | Young, 1889 | Coefficents calculated by NIST from author's data. |
Enthalpy of fusion
ΔfusH (kcal/mol) | Temperature (K) | Reference | Comment |
---|---|---|---|
2.33 | 241.8 | Domalski and Hearing, 1996 | AC |
2.330 | 241.83 | Stull, 1937 | DH |
Entropy of fusion
ΔfusS (cal/mol*K) | Temperature (K) | Reference | Comment |
---|---|---|---|
9.634 | 241.83 | Stull, 1937 | DH |

Reaction thermochemistry data

Data compiled as indicated in comments:
M - Michael M. Meot-Ner (Mautner) and Sharon G. Lias
B - John E. Bartmess
ALS - Hussein Y. Afeefy, Joel F. Liebman, and Stephen E. Stein
Individual Reactions
By formula: C6H7N+ + C6H5I = (C6H7N+ • C6H5I)
Bond type: Charge transfer bond (positive ion)
Quantity | Value | Units | Method | Reference | Comment |
---|---|---|---|---|---|
ΔrH° | 13.3 | kcal/mol | PHPMS | Meot-Ner (Mautner) and El-Shall, 1986 | gas phase; Entropy change calculated or estimated; M |
Quantity | Value | Units | Method | Reference | Comment |
ΔrS° | 26. | cal/mol*K | N/A | Meot-Ner (Mautner) and El-Shall, 1986 | gas phase; Entropy change calculated or estimated; M |
Free energy of reaction
ΔrG° (kcal/mol) | T (K) | Method | Reference | Comment |
---|---|---|---|---|
4.8 | 324. | PHPMS | Meot-Ner (Mautner) and El-Shall, 1986 | gas phase; Entropy change calculated or estimated; M |
By formula: Cl- + C6H5I = (Cl- • C6H5I)
Quantity | Value | Units | Method | Reference | Comment |
---|---|---|---|---|---|
ΔrG° | 7.20 | kcal/mol | TDEq | French, Ikuta, et al., 1982 | gas phase; B |
Free energy of reaction
ΔrG° (kcal/mol) | T (K) | Method | Reference | Comment |
---|---|---|---|---|
7.2 | 300. | PHPMS | French, Ikuta, et al., 1982 | gas phase; M |
By formula: HI + C6H5I = C6H6 + I2
Quantity | Value | Units | Method | Reference | Comment |
---|---|---|---|---|---|
ΔrH° | -5.2 ± 1.4 | kcal/mol | Cm | Graham, Nichol, et al., 1955 | gas phase; ALS |

Henry's Law data

Data compiled by: Rolf Sander
Henry's Law constant (water solution)
kH(T) = k°H exp(d(ln(kH))/d(1/T) ((1/T) - 1/(298.15 K)))
k°H = Henry's law constant for solubility in water at 298.15 K (mol/(kg*bar))
d(ln(kH))/d(1/T) = Temperature dependence constant (K)
k°H (mol/(kg*bar)) | d(ln(kH))/d(1/T) (K) | Method | Reference | Comment |
---|---|---|---|---|
0.74 | Q | N/A | missing citation give several references for the Henry's law constants but don't assign them to specific species. | |
0.78 | L | N/A |

Ion clustering data

Data compiled as indicated in comments:
M - Michael M. Meot-Ner (Mautner) and Sharon G. Lias
B - John E. Bartmess
Clustering reactions
By formula: C6H7N+ + C6H5I = (C6H7N+ • C6H5I)
Bond type: Charge transfer bond (positive ion)
Quantity | Value | Units | Method | Reference | Comment |
---|---|---|---|---|---|
ΔrH° | 13.3 | kcal/mol | PHPMS | Meot-Ner (Mautner) and El-Shall, 1986 | gas phase; Entropy change calculated or estimated; M |
Quantity | Value | Units | Method | Reference | Comment |
ΔrS° | 26. | cal/mol*K | N/A | Meot-Ner (Mautner) and El-Shall, 1986 | gas phase; Entropy change calculated or estimated; M |
Free energy of reaction
ΔrG° (kcal/mol) | T (K) | Method | Reference | Comment |
---|---|---|---|---|
4.8 | 324. | PHPMS | Meot-Ner (Mautner) and El-Shall, 1986 | gas phase; Entropy change calculated or estimated; M |
By formula: Cl- + C6H5I = (Cl- • C6H5I)
Quantity | Value | Units | Method | Reference | Comment |
---|---|---|---|---|---|
ΔrG° | 7.20 | kcal/mol | TDEq | French, Ikuta, et al., 1982 | gas phase; B |
Free energy of reaction
ΔrG° (kcal/mol) | T (K) | Method | Reference | Comment |
---|---|---|---|---|
7.2 | 300. | PHPMS | French, Ikuta, et al., 1982 | gas phase; M |

References

Smith, 1956
Smith, L.,
Corrected heats of combustion of organic iodine compounds,
Acta Chem. Scand., 1956, 10, 884-886. [all data]
Cox and Pilcher, 1970
Cox, J.D.; Pilcher, G.,
Thermochemistry of Organic and Organometallic Compounds, Academic Press, New York, 1970, 1-636. [all data]
Stull, 1937
Stull, D.R.,
A semi-micro calorimeter for measuring heat capacities at low temperatures,
J. Am. Chem. Soc., 1937, 59, 2726-2733. [all data]
Shehatta, 1993
Shehatta, I.,
Heat capacity at constant pressure of some halogen compounds,
Thermochim. Acta, 1993, 213, 1-10. [all data]
Aoyama and Kanda, 1935
Aoyama, S.; Kanda, E.,
Studies on the heat capacities at low temperature. Report I. Heat capacities of some organic substances at low temperature,
Sci. Rept. Tohoku Imp. Univ. [1]24, 1935, 107-115. [all data]
Fujisawa, Ohno, et al., 1986
Fujisawa, S.; Ohno, K.; Masuda, S.; Harada, Y.,
Penning ionization electron spectroscopy of monohalogenobenzenes: C6H5F, C6H5Cl, C6H5Br, and C6H5I,
J. Am. Chem. Soc., 1986, 108, 6505. [all data]
Klasinc, Kovac, et al., 1983
Klasinc, L.; Kovac, B.; Gusten, H.,
Photoelectron spectra of acenes. Electronic structure and substituent effects,
Pure Appl. Chem., 1983, 55, 289. [all data]
Dannacher, Rosenstock, et al., 1983
Dannacher, J.; Rosenstock, H.M.; Buff, R.; Parr, A.C.; Stockbauer, R.L.; Bombach, R.; Stadelmann, J.-P.,
Benchmark measurement of iodobenzene ion fragmentation rates,
Chem. Phys., 1983, 75, 23. [all data]
Kimura, Katsumata, et al., 1981
Kimura, K.; Katsumata, S.; Achiba, Y.; Yamazaki, T.; Iwata, S.,
Ionization energies, Ab initio assignments, and valence electronic structure for 200 molecules
in Handbook of HeI Photoelectron Spectra of Fundamental Organic Compounds, Japan Scientific Soc. Press, Tokyo, 1981. [all data]
Behan, Johnstone, et al., 1976
Behan, J.M.; Johnstone, R.A.W.; Bentley, T.W.,
An evaluation of empirical methods for calculating the ionization potentials of substituted benzenes,
Org. Mass Spectrom., 1976, 11, 207. [all data]
Baldwin, Loudon, et al., 1976
Baldwin, M.A.; Loudon, A.G.; Maccoll, A.; Webb, K.S.,
The nature and fragmentation pathways of the molecular ions of some arylureas, arylthioureas, acetanilides, thioacetanilides and related compounds,
Org. Mass Spectrom., 1976, 11, 1181. [all data]
Baer, Tsai, et al., 1976
Baer, T.; Tsai, B.P.; Smith, D.; Murray, P.T.,
Absolute unimolecular decay rates of energy selected metastable halobenzene ions,
J. Chem. Phys., 1976, 64, 2460. [all data]
Boschi and Salahub, 1974
Boschi, R.A.A.; Salahub, D.R.,
The high resolution photoelectron spectra of some iodoalkanes, iodocycloalkanes, iodoalkenes, and fluoroiodohydrocarbons,
Can. J. Chem., 1974, 52, 1217. [all data]
Sergeev, Akopyan, et al., 1970
Sergeev, Yu.L.; Akopyan, M.E.; Vilesov, F.I.; Kleimenov, V.I.,
Photoionization processes in phenyl halides,
Opt. i Spektroskopiya, 1970, 29, 119, In original 63. [all data]
Momigny, Goffart, et al., 1968
Momigny, J.; Goffart, C.; D'Or, L.,
Photoionization studies by total ionization measurements. I. Benzene and its monohalogeno derivatives,
Intern. J. Mass Spectrom. Ion Phys., 1968, 1, 53. [all data]
Watanabe, 1957
Watanabe, K.,
Ionization potentials of some molecules,
J. Chem. Phys., 1957, 26, 542. [all data]
Potts, Lyus, et al., 1980
Potts, A.W.; Lyus, M.L.; Lee, E.P.F.; Fattahallah, G.H.,
High resolution ultraviolet photoelectron spectra of C6H5X and p-C6H4X2 where X = Cl, Br or I,
J. Chem. Soc. Faraday Trans. 2, 1980, 76, 556. [all data]
Sell and Kupperman, 1978
Sell, J.A.; Kupperman, A.,
Angular distributions in the photoelectron spectra of benzene and its monohalogenated derivatives,
Chem. Phys., 1978, 33, 367. [all data]
Malinovich and Lifshitz, 1986
Malinovich, Y.; Lifshitz, C.,
Time-dependent mass spectra and breakdown graphs. 7. Time-resolved photoionization mass spectrometry of iodobenzene. The heat of formation of C6H5+,
J. Phys. Chem., 1986, 90, 2200. [all data]
Lifshitz and Malinovich, 1984
Lifshitz, C.; Malinovich, Y.,
Time resolved photoionization mass spectrometry in the millisecond range,
Int. J. Mass Spectrom. Ion Processes, 1984, 60, 99. [all data]
Gefen and Lifshitz, 1984
Gefen, S.; Lifshitz, C.,
Time-dependent mass spectra and breakdown graphs. V. The kinetic shift in iodobenzene,
Int. J. Mass Spectrom. Ion Processes, 1984, 58, 251. [all data]
Dunbar and Honovich, 1984
Dunbar, R.C.; Honovich, J.P.,
Threshold ion photodissociation. Bromobenzene and iodobenzene ions,
Int. J. Mass Spectrom. Ion Processes, 1984, 58, 25. [all data]
Burgers and Holmes, 1984
Burgers, P.C.; Holmes, J.L.,
Fragmentation rate constants and appearance energies for reactions having a large kinetic shift and the energy partitioning in their metastable decomposition,
Int. J. Mass Spectrom. Ion Processes, 1984, 58, 15. [all data]
Burgers and Holmes, 1982
Burgers, P.C.; Holmes, J.L.,
Metastable ion studies. XIII. The measurement of appearance energies of metastable peaks,
Org. Mass Spectrom., 1982, 17, 123. [all data]
Johnstone and Mellon, 1972
Johnstone, R.A.W.; Mellon, F.A.,
Electron-impact ionization and appearance potentials,
J. Chem. Soc. Faraday Trans. 2, 1972, 68, 1209. [all data]
Howe and Williams, 1969
Howe, I.; Williams, D.H.,
Calculation and qualitative predictions of mass spectra. Mono- and paradisubstituted benzenes,
J. Am. Chem. Soc., 1969, 91, 7137. [all data]