Phosphine, ethyl-ethoxy-(diethylamino)-

Gas phase ion energetics data

Data compiled by: Sharon G. Lias, John E. Bartmess, Joel F. Liebman, John L. Holmes, Rhoda D. Levin, and W. Gary Mallard

Ionization energy determinations

IE (eV) Method Reference Comment
8.17PEZverev, Vakar, et al., 1986Vertical value

References

Zverev, Vakar, et al., 1986
Zverev, V.V.; Vakar, V.M.; Villem, Y.Y.; Villen, N.V.; Karelov, A.A., Photoelectron spectra and electronic structures of organophosphorus compounds. Timethylsilyl phosphites and amidophosphites, J. Gen. Chem. USSR, 1986, 56, 1807. [all data]