Acetamide, N-(aminocarbonyl)-
- Formula: C3H6N2O2
- Molecular weight: 102.0919
- IUPAC Standard InChIKey: GKRZNOGGALENQJ-UHFFFAOYSA-N
- CAS Registry Number: 591-07-1
- Chemical structure:

Gas phase thermochemistry data

Data compiled by: Hussein Y. Afeefy, Joel F. Liebman, and Stephen E. Stein
Quantity | Value | Units | Method | Reference | Comment |
---|---|---|---|---|---|
ΔfH°gas | -441.7 ± 0.9 | kJ/mol | Ccr | Imamura, Takahashi, et al., 1989 | see Imamura, Murata, et al., 1988 |

Condensed phase thermochemistry data

Data compiled by: Hussein Y. Afeefy, Joel F. Liebman, and Stephen E. Stein
Quantity | Value | Units | Method | Reference | Comment |
---|---|---|---|---|---|
ΔfH°solid | -544.74 ± 0.55 | kJ/mol | Ccr | Imamura, Takahashi, et al., 1989 | see Imamura, Murata, et al., 1988 |
Quantity | Value | Units | Method | Reference | Comment |
ΔcH°solid | -1493.3 ± 0.3 | kJ/mol | Ccr | Imamura, Takahashi, et al., 1989 | see Imamura, Murata, et al., 1988 |

Phase change data

Data compiled as indicated in comments:
ALS - Hussein Y. Afeefy, Joel F. Liebman, and Stephen E. Stein
AC - William E. Acree, Jr., James S. Chickos
Quantity | Value | Units | Method | Reference | Comment |
---|---|---|---|---|---|
ΔsubH° | 103.05 ± 0.67 | kJ/mol | C | Imamura, Takahashi, et al., 1989 | see Imamura, Murata, et al., 1988; ALS |
ΔsubH° | 103.1 ± 0.7 | kJ/mol | N/A | Imamura, Murata, et al., 1988 | AC |
ΔsubH° | 103.1 ± 0.7 | kJ/mol | C | Murata, Sakiyama, et al., 1985 | AC |
Enthalpy of sublimation
ΔsubH (kJ/mol) | Temperature (K) | Reference | Comment |
---|---|---|---|
102.4 ± 0.7 | 383. | Imamura, Murata, et al., 1988 | Based on data from 360. to 407. K.; AC |

Reaction thermochemistry data

Data compiled by: John E. Bartmess
Individual Reactions
C3H5N2O2- + =
By formula: C3H5N2O2- + H+ = C3H6N2O2
Quantity | Value | Units | Method | Reference | Comment |
---|---|---|---|---|---|
ΔrH° | 1458. ± 12. | kJ/mol | G+TS | Cumming and Kebarle, 1978 | gas phase; Acid: acetylurea |
Quantity | Value | Units | Method | Reference | Comment |
ΔrG° | 1427. ± 8.4 | kJ/mol | IMRE | Cumming and Kebarle, 1978 | gas phase; Acid: acetylurea |

Gas phase ion energetics data

Data compiled as indicated in comments:
B - John E. Bartmess
LLK - Sharon G. Lias, Rhoda D. Levin, and Sherif A. Kafafi
Ionization energy determinations
IE (eV) | Method | Reference | Comment |
---|---|---|---|
10.3 | PE | Dougherty, Wittel, et al., 1976 | Vertical value; LLK |
De-protonation reactions
C3H5N2O2- + =
By formula: C3H5N2O2- + H+ = C3H6N2O2
Quantity | Value | Units | Method | Reference | Comment |
---|---|---|---|---|---|
ΔrH° | 1458. ± 12. | kJ/mol | G+TS | Cumming and Kebarle, 1978 | gas phase; Acid: acetylurea; B |
Quantity | Value | Units | Method | Reference | Comment |
ΔrG° | 1427. ± 8.4 | kJ/mol | IMRE | Cumming and Kebarle, 1978 | gas phase; Acid: acetylurea; B |

References

Imamura, Takahashi, et al., 1989
Imamura, A.; Takahashi, K.; Murata, S.; Sakiyama, M.,
Standard enthalpies of formation of trimethyl cyanurate, malonamide, and 1,3-dimethyluracil,
J. Chem. Thermodyn., 1989, 21, 237-246. [all data]
Imamura, Murata, et al., 1988
Imamura, A.; Murata, S.; Sakiyama, M.,
Combustion and sublimation calorimetric studies on acetylurea and trimethyl isocyanurate,
J. Chem. Thermodyn., 1988, 20, 389-396. [all data]
Murata, Sakiyama, et al., 1985
Murata, S.; Sakiyama, M.; Seki, S.,
Sublimation calorimetric studies using a calvet microcalorimeter,
Thermochimica Acta, 1985, 88, 1, 121-126, https://doi.org/10.1016/0040-6031(85)85419-8
. [all data]
Cumming and Kebarle, 1978
Cumming, J.B.; Kebarle, P.,
Summary of gas phase measurements involving acids AH. Entropy changes in proton transfer reactions involving negative ions. Bond dissociation energies D(A-H) and electron affinities EA(A),
Can. J. Chem., 1978, 56, 1. [all data]
Dougherty, Wittel, et al., 1976
Dougherty, D.; Wittel, K.; Meeks, J.; McGlynn, S.P.,
Photoelectron spectroscopy of carbonyls. Ureas, uracils, and thymine,
J. Am. Chem. Soc., 1976, 98, 3815. [all data]