Propanoic acid, 3-bromo-
- Formula: C3H5BrO2
- Molecular weight: 152.975
- IUPAC Standard InChIKey: DHXNZYCXMFBMHE-UHFFFAOYSA-N
- CAS Registry Number: 590-92-1
- Chemical structure:

Phase change data

Data compiled by: Robert L. Brown and Stephen E. Stein
Reduced pressure boiling point
Tboil (K) | Pressure (bar) | Reference |
---|---|---|
414.2 | 0.060 | Weast and Grasselli, 1989 |

Gas phase ion energetics data

Data compiled by: Sharon G. Lias and Joel F. Liebman
Appearance energy determinations
Ion | AE (eV) | Other Products | Method | Reference | Comment |
---|---|---|---|---|---|
CHO2+ | 11.92 | BrCH2CH2 | EI | Holmes and Lossing, 1988 | |
C3H5O2+ | 10.52 | Br | EI | Suh, Kingsmill, et al., 1993 |

Van Den Dool and Kratz RI, non-polar column, custom temperature program

View large format table.

Column type Active phase I Reference Comment
CapillaryVF-5MS1024.Tretyakov, 201130. m/0.25 mm/0.25 μm, He; Program: Multi-step temperature program; T(initial)=60C; T(final)=270C

References

Weast and Grasselli, 1989
CRC Handbook of Data on Organic Compounds, 2nd Editon, Weast,R.C and Grasselli, J.G., ed(s)., CRC Press, Inc., Boca Raton, FL, 1989, 1. [all data]
Holmes and Lossing, 1988
Holmes, J.L.; Lossing, F.P.,
Heats of formation and bond dissociation energies in halogen-substituted methyl and ethyl radicals,
J. Am. Chem. Soc., 1988, 110, 7343. [all data]
Suh, Kingsmill, et al., 1993
Suh, D.; Kingsmill, C.A.; Ruttink, P.J.A.; Terlouw, J.K.; Burgers, P.,
Isomerization and dissociation processes of protonated -propiolactone and related C3H5O2+ isomers: a combined experimental and theoretical study,
Org. Mass Spectrom., 1993, 28, 1270. [all data]