CH3C(O)CH2CH2OH
- Formula: C4H8O2
- Molecular weight: 88.1051
- IUPAC Standard InChIKey: LVSQXDHWDCMMRJ-UHFFFAOYSA-N
- CAS Registry Number: 590-90-9
- Chemical structure:

Phase change data

Data compiled by: Robert L. Brown and Stephen E. Stein
Reduced pressure boiling point
Tboil (K) | Pressure (bar) | Reference |
---|---|---|
382.7 | 0.040 | Weast and Grasselli, 1989 |
363.2 | 0.015 | Weast and Grasselli, 1989 |

Gas phase ion energetics data

Data compiled by: Sharon G. Lias and Joel F. Liebman
Appearance energy determinations
Ion | AE (eV) | Other Products | Method | Reference | Comment |
---|---|---|---|---|---|
C2H5O+ | 10.20 | C2H3O | EI | Holmes, Lossing, et al., 1991 |

Kovats' RI, non-polar column, isothermal

Column type | Active phase | Temperature (C) | I | Reference | Comment |
---|---|---|---|---|---|
Packed | Apiezon L | 160. | 751. | Bogoslovsky, Anvaer, et al., 1978 | Celite 545 |

Normal alkane RI, non-polar column, custom temperature program

Column type | Active phase | I | Reference | Comment |
---|---|---|---|---|
Capillary | SLB-5 MS | 798. | Mondello, 2012 | 30. m/0.25 mm/0.25 μm, Helium; Program: not specified |
Capillary | SLB-5 MS | 814. | Mondello, 2012 | 30. m/0.25 mm/0.25 μm, Helium; Program: not specified |
Capillary | OV-101 | 755. | Zenkevich and Malamakhov, 1987 | He; Column length: 50. m; Column diameter: 0.24 mm; Program: not specified |

References

Weast and Grasselli, 1989
CRC Handbook of Data on Organic Compounds, 2nd Editon, Weast,R.C and Grasselli, J.G., ed(s)., CRC Press, Inc., Boca Raton, FL, 1989, 1. [all data]
Holmes, Lossing, et al., 1991
Holmes, J.L.; Lossing, F.P.; Mayer, P.M.,
Heats of formation of oxygen-containing organic free radicals from appearance energy measurements,
J. Am. Chem. Soc., 1991, 113, 9723. [all data]