Silane,benzoyltrimethyl-
- Formula: C10H14OSi
- Molecular weight: 178.3031
- IUPAC Standard InChIKey: KJPBNYMAKNNPDA-UHFFFAOYSA-N
- CAS Registry Number: 5908-41-8
- Chemical structure:
View 3d structure (requires JavaScript / HTML 5) - Permanent link for this species. Use this link for bookmarking this species for future reference.

Gas phase ion energetics data

Data compiled as indicated in comments:
LLK - Sharon G. Lias, Rhoda D. Levin, and Sherif A. Kafafi
RDSH - Henry M. Rosenstock, Keith Draxl, Bruce W. Steiner, and John T. Herron
Ionization energy determinations
IE (eV) | Method | Reference | Comment |
---|---|---|---|
7.96 | PE | Brown, 1975 | LLK |
8.20 ± 0.04 | EI | Bock, Seidl, et al., 1968 | RDSH |

References

Brown, 1975
Brown, R.S.,
A photoelectron investigation of acyl silanes: The photoelectron spectra of trimethylsilyl phenyl ketone and phenyl tert-butyl ketone,
Can. J. Chem., 1975, 53, 2446. [all data]
Bock, Seidl, et al., 1968
Bock, H.; Seidl, H.; Fochler, M.,
d-Orbitaleffekte in silicium-substituierten π-Elektronensystemen. X. Vertikale Ionisierungsenergien von Alkyl- und Silyl-benzolen,
Chem. Ber., 1968, 101, 2815. [all data]