1,2-Butadiene
- Formula: C4H6
- Molecular weight: 54.0904
- IUPAC Standard InChIKey: QNRMTGGDHLBXQZ-UHFFFAOYSA-N
- CAS Registry Number: 590-19-2
- Chemical structure:
View 3d structure (requires JavaScript / HTML 5) - Other names: Allene, methyl-; Methylallene; CH2=C=CHCH3; Buta-1,2-diene

Gas phase thermochemistry data

Data compiled as indicated in comments:
ALS - Hussein Y. Afeefy, Joel F. Liebman, and Stephen E. Stein
GT - Glushko Thermocenter, Russian Academy of Sciences, Moscow
Quantity | Value | Units | Method | Reference | Comment |
---|---|---|---|---|---|
ΔfH°gas | 162.2 ± 0.59 | kJ/mol | Cm | Prosen, Maron, et al., 1951 | ALS |
ΔfH°gas | 165.4 ± 1.2 | kJ/mol | Ccb | Prosen, Maron, et al., 1949 | ALS |
Quantity | Value | Units | Method | Reference | Comment |
ΔcH°gas | -2593.8 ± 0.54 | kJ/mol | Cm | Prosen, Maron, et al., 1951 | Corresponding ΔfHºgas = 162.3 kJ/mol (simple calculation by NIST; no Washburn corrections); ALS |
ΔcH°gas | -2597.0 ± 1.2 | kJ/mol | Ccb | Prosen, Maron, et al., 1949 | Corresponding ΔfHºgas = 165.4 kJ/mol (simple calculation by NIST; no Washburn corrections); ALS |
Constant pressure heat capacity of gas
Cp,gas (J/mol*K) | Temperature (K) | Reference | Comment |
---|---|---|---|
35.83 | 50. | Thermodynamics Research Center, 1997 | Recommended values are in close agreement with those obtained from earlier statistical thermodynamics calculation [ Kilpatrick J.E., 1949].; GT |
45.63 | 100. | ||
54.41 | 150. | ||
62.51 | 200. | ||
75.00 | 273.15 | ||
79.48 | 298.15 | ||
79.81 | 300. | ||
97.62 | 400. | ||
113.74 | 500. | ||
127.62 | 600. | ||
139.54 | 700. | ||
149.8 | 800. | ||
159.8 | 900. | ||
166.5 | 1000. | ||
173.3 | 1100. | ||
179.1 | 1200. | ||
184.2 | 1300. | ||
188.6 | 1400. | ||
192.4 | 1500. |

Condensed phase thermochemistry data

Data compiled by: Eugene S. Domalski and Elizabeth D. Hearing
Quantity | Value | Units | Method | Reference | Comment |
---|---|---|---|---|---|
S°liquid | 206.19 | J/mol*K | N/A | Aston and Szasz, 1947 |
Constant pressure heat capacity of liquid
Cp,liquid (J/mol*K) | Temperature (K) | Reference | Comment |
---|---|---|---|
122.80 | 290. | Aston and Szasz, 1947 | T = 14 to 282 K. |

Phase change data

Data compiled as indicated in comments:
TRC - Thermodynamics Research Center, NIST Boulder Laboratories, Chris Muzny director
AC - William E. Acree, Jr., James S. Chickos
DH - Eugene S. Domalski and Elizabeth D. Hearing
ALS - Hussein Y. Afeefy, Joel F. Liebman, and Stephen E. Stein
Quantity | Value | Units | Method | Reference | Comment |
---|---|---|---|---|---|
Tboil | 284. | K | N/A | Majer and Svoboda, 1985 | |
Tboil | 291.7 | K | N/A | Feugeas and Giusti, 1968 | Uncertainty assigned by TRC = 2. K; TRC |
Tboil | 284.06 | K | N/A | Streiff, Murphy, et al., 1946 | Uncertainty assigned by TRC = 0.3 K; TRC |
Tboil | 283.5 | K | N/A | Hurd and Meinert, 1931 | Uncertainty assigned by TRC = 0.5 K; TRC |
Quantity | Value | Units | Method | Reference | Comment |
Tfus | 136.940 | K | N/A | Streiff, Murphy, et al., 1947 | Uncertainty assigned by TRC = 0.05 K; TRC |
Tfus | 136.960 | K | N/A | Streiff, Murphy, et al., 1947 | Uncertainty assigned by TRC = 0.02 K; TRC |
Quantity | Value | Units | Method | Reference | Comment |
Ttriple | 136.920 | K | N/A | Aston and Szasz, 1947, 2 | Uncertainty assigned by TRC = 0.06 K; TRC |
Ttriple | 136.950 | K | N/A | Aston and Szasz, 1947, 2 | Uncertainty assigned by TRC = 0.05 K; TRC |
Ttriple | 136.94 | K | N/A | Tooke and Aston, 1945 | Uncertainty assigned by TRC = 0.08 K; TRC |
Quantity | Value | Units | Method | Reference | Comment |
ΔvapH° | 23.68 | kJ/mol | N/A | Majer and Svoboda, 1985 | |
ΔvapH° | 23.9 | kJ/mol | N/A | Reid, 1972 | AC |
Enthalpy of vaporization
ΔvapH (kJ/mol) | Temperature (K) | Method | Reference | Comment |
---|---|---|---|---|
24.623 | 273.24 | N/A | Aston and Szasz, 1947 | P = 66.41 kPa; DH |
24.02 | 284. | N/A | Majer and Svoboda, 1985 | |
25.3 | 276. | A | Stephenson and Malanowski, 1987 | Based on data from 243. to 291. K.; AC |
26.4 | 228. | A | Stephenson and Malanowski, 1987 | Based on data from 204. to 243. K.; AC |
24.6 ± 0.3 | 273.25 | C | Aston and Szasz, 1947, 3 | ALS |
24.6 ± 0.1 | 273. | C | Aston and Szasz, 1947 | AC |
25.2 | 276. | N/A | Stull, 1947 | Based on data from 184. to 291. K.; AC |
Entropy of vaporization
ΔvapS (J/mol*K) | Temperature (K) | Reference | Comment |
---|---|---|---|
90.11 | 273.24 | Aston and Szasz, 1947 | P; DH |
Antoine Equation Parameters
log10(P) = A − (B / (T + C))
P = vapor pressure (bar)
T = temperature (K)
View plot Requires a JavaScript / HTML 5 canvas capable browser.
Temperature (K) | A | B | C | Reference | Comment |
---|---|---|---|---|---|
184. to 291.7 | 3.78159 | 941.601 | -42.565 | Stull, 1947 | Coefficents calculated by NIST from author's data. |
Enthalpy of fusion
ΔfusH (kJ/mol) | Temperature (K) | Reference | Comment |
---|---|---|---|
6.9613 | 136.92 | Aston and Szasz, 1947 | DH |
6.95 | 136.9 | Domalski and Hearing, 1996 | AC |
Entropy of fusion
ΔfusS (J/mol*K) | Temperature (K) | Reference | Comment |
---|---|---|---|
50.84 | 136.92 | Aston and Szasz, 1947 | DH |

Reaction thermochemistry data

Data compiled as indicated in comments:
B - John E. Bartmess
ALS - Hussein Y. Afeefy, Joel F. Liebman, and Stephen E. Stein
Individual Reactions
C4H5- + =
Quantity | Value | Units | Method | Reference | Comment |
---|---|---|---|---|---|
ΔrH° | 1608. ± 8.8 | kJ/mol | G+TS | N/A | gas phase; Relative to dGacid(MeOH)= 375. Acid: MeCH=C=CH2; B |
Quantity | Value | Units | Method | Reference | Comment |
ΔrG° | 1574. ± 8.4 | kJ/mol | IMRE | N/A | gas phase; Relative to dGacid(MeOH)= 375. Acid: MeCH=C=CH2; B |
By formula: C4H6 = C4H6
Quantity | Value | Units | Method | Reference | Comment |
---|---|---|---|---|---|
ΔrH° | 53.47 ± 0.67 | kJ/mol | Ccb | Prosen, Maron, et al., 1949 | gas phase; ALS |

Gas phase ion energetics data

Data evaluated as indicated in comments:
HL - Edward P. Hunter and Sharon G. Lias
Data compiled as indicated in comments:
B - John E. Bartmess
LLK - Sharon G. Lias, Rhoda D. Levin, and Sherif A. Kafafi
RDSH - Henry M. Rosenstock, Keith Draxl, Bruce W. Steiner, and John T. Herron
Quantity | Value | Units | Method | Reference | Comment |
---|---|---|---|---|---|
Proton affinity (review) | 778.9 | kJ/mol | N/A | Hunter and Lias, 1998 | HL |
Quantity | Value | Units | Method | Reference | Comment |
Gas basicity | 749.8 | kJ/mol | N/A | Hunter and Lias, 1998 | HL |
Ionization energy determinations
IE (eV) | Method | Reference | Comment |
---|---|---|---|
9.03 | PE | Beez, Bieri, et al., 1973 | LLK |
9.23 ± 0.02 | PI | Parr and Elder, 1968 | RDSH |
9.33 ± 0.02 | PE | Bieri, Burger, et al., 1977 | Vertical value; LLK |
9.0 | PE | White, Carlson, et al., 1974 | Vertical value; LLK |
9.33 | PE | Brogli, Crandall, et al., 1973 | Vertical value; LLK |
Appearance energy determinations
Ion | AE (eV) | Other Products | Method | Reference | Comment |
---|---|---|---|---|---|
CH3+ | 14.4 ± 0.2 | ? | EI | Collin and Lossing, 1957 | RDSH |
C3H3+ | 10.86 ± 0.04 | CH3 | PI | Parr and Elder, 1968 | RDSH |
C4H5+ | 11.04 ± 0.04 | H | PI | Parr and Elder, 1968 | RDSH |
De-protonation reactions
C4H5- + =
Quantity | Value | Units | Method | Reference | Comment |
---|---|---|---|---|---|
ΔrH° | 1608. ± 8.8 | kJ/mol | G+TS | N/A | gas phase; Relative to dGacid(MeOH)= 375. Acid: MeCH=C=CH2; B |
Quantity | Value | Units | Method | Reference | Comment |
ΔrG° | 1574. ± 8.4 | kJ/mol | IMRE | N/A | gas phase; Relative to dGacid(MeOH)= 375. Acid: MeCH=C=CH2; B |

Kovats' RI, non-polar column, isothermal

View large format table.

Column type Active phase Temperature (C) I Reference Comment
CapillarySqualane50.428.5Bajus, Veselý, et al., 1979Column length: 100. m; Column diameter: 0.25 mm
CapillarySqualane70.427.9Bajus, Veselý, et al., 1979Column length: 100. m; Column diameter: 0.25 mm
PackedSqualane27.429.Hively and Hinton, 1968He, Chromosorb P; Column length: 15. m; Column diameter: 0.25 mm
PackedSqualane49.430.Hively and Hinton, 1968He, Chromosorb P; Column length: 15. m; Column diameter: 0.25 mm
PackedSqualane67.430.Hively and Hinton, 1968He, Chromosorb P; Column length: 15. m; Column diameter: 0.25 mm
PackedSqualane86.430.Hively and Hinton, 1968He, Chromosorb P; Column length: 15. m; Column diameter: 0.25 mm
PackedSE-3070.448.Widmer, 1967Diatoport S; Column length: 7.9 m
PackedSqualane26.427.Zulaïca and Guiochon, 1966Column length: 10. m

Kovats' RI, non-polar column, custom temperature program

View large format table.

Column type Active phase I Reference Comment
CapillaryPetrocol DH-100450.Haagen-Smit Laboratory, 1997He; Column length: 100. m; Column diameter: 0.2 mm; Program: 5C(10min) => 5C/min => 50C(48min) => 1.5C/min => 195C(91min)

Kovats' RI, polar column, isothermal

View large format table.

Column type Active phase Temperature (C) I Reference Comment
PackedCarbowax 20M130.562.Widmer, 1967Diatoport P; Column length: 7.9 m
PackedCarbowax 20M70.540.Widmer, 1967Diatoport P; Column length: 7.9 m

Normal alkane RI, non-polar column, temperature ramp

View large format table.

Column type Active phase I Reference Comment
CapillaryPolydimethyl siloxane: CP-Sil 5 CB441.Bramston-Cook, 201360. m/0.25 mm/1.0 μm, Helium, 45. C @ 1.45 min, 3.6 K/min, 210. C @ 2.72 min
CapillaryOV-101427.Zenkevich, 200525. m/0.20 mm/0.10 μm, N2/He, 6. K/min; Tstart: 50. C; Tend: 250. C

References

Prosen, Maron, et al., 1951
Prosen, E.J.; Maron, F.W.; Rossini, F.D.,
Heats of combustion, formation, and insomerization of ten C4 hydrocarbons,
J. Res. NBS, 1951, 46, 106-112. [all data]
Prosen, Maron, et al., 1949
Prosen, E.J.; Maron, F.W.; Rossini, F.D.,
Heat of isomerization of the two butadienes,
J. Res. NBS, 1949, 42, 269-275. [all data]
Thermodynamics Research Center, 1997
Thermodynamics Research Center,
Selected Values of Properties of Chemical Compounds., Thermodynamics Research Center, Texas A&M University, College Station, Texas, 1997. [all data]
Kilpatrick J.E., 1949
Kilpatrick J.E.,
Heats, equilibrium constants, and free energies of formation of the C3 to C5 diolefins, styrene, and the methylstyrenes,
J. Res. Nat. Bur. Stand., 1949, 42, 225-240. [all data]
Aston and Szasz, 1947
Aston, J.G.; Szasz, G.J.,
The thermodynamics of butadiene-1,2 from calorimetric and spectroscopic data,
J. Am. Chem. Soc., 1947, 69, 3108-3114. [all data]
Majer and Svoboda, 1985
Majer, V.; Svoboda, V.,
Enthalpies of Vaporization of Organic Compounds: A Critical Review and Data Compilation, Blackwell Scientific Publications, Oxford, 1985, 300. [all data]
Feugeas and Giusti, 1968
Feugeas, C.; Giusti, G.L.,
C. R. Acad. Sci. Paris, Ser. C, 1968, 267, 84. [all data]
Streiff, Murphy, et al., 1946
Streiff, A.J.; Murphy, E.T.; Cahill, J.C.; Soule, L.F.; Sedlak, V.A.; Willingham, C.B.; Rossini, F.D.,
, Am. Pet. Inst. Res. Proj. 6, unpublished, Natl. Bur. Stand., 1946. [all data]
Hurd and Meinert, 1931
Hurd, C.D.; Meinert, R.N.,
Synthesis and pyrolysis of methylallene and ethylacetylene,
J. Am. Chem. Soc., 1931, 53, 289-300. [all data]
Streiff, Murphy, et al., 1947
Streiff, A.J.; Murphy, E.T.; Zimmerman, J.C.; Soule, L.F.; Sedlak, V.A.; Willingham, C.B.; Rossini, F.D.,
Purification, purity, and freezing points of n-decane, 4 alkylcyclopentanes 9 alkylcyclohexanes, 2 monoolefins, 1,2-butadiene, and 2-butyne of the API-standard and API-NBS series.,
J. Res. Natl. Bur. Stand. (U. S.), 1947, 39, 321. [all data]
Aston and Szasz, 1947, 2
Aston, J.G.; Szasz, G.J.,
The Thermodynamics of Butadiene-1,2 from Calorimetric and Spectroscopic Data,
J. Am. Chem. Soc., 1947, 69, 3108. [all data]
Tooke and Aston, 1945
Tooke, J.W.; Aston, J.G.,
Solid Solutions in Hydrocarbon Systems,
J. Am. Chem. Soc., 1945, 67, 2275. [all data]
Reid, 1972
Reid, Robert C.,
Handbook on vapor pressure and heats of vaporization of hydrocarbons and related compounds, R. C. Wilhort and B. J. Zwolinski, Texas A Research Foundation. College Station, Texas(1971). 329 pages.$10.00,
AIChE J., 1972, 18, 6, 1278-1278, https://doi.org/10.1002/aic.690180637
. [all data]
Stephenson and Malanowski, 1987
Stephenson, Richard M.; Malanowski, Stanislaw,
Handbook of the Thermodynamics of Organic Compounds, 1987, https://doi.org/10.1007/978-94-009-3173-2
. [all data]
Aston and Szasz, 1947, 3
Aston, J.G.; Szasz, G.J.,
The thermodynamics of butadiene-1,2 from calorimetric and spectroscopic data,
J. Am. Chem. Soc., 1947, 69, 3108-31. [all data]
Stull, 1947
Stull, Daniel R.,
Vapor Pressure of Pure Substances. Organic and Inorganic Compounds,
Ind. Eng. Chem., 1947, 39, 4, 517-540, https://doi.org/10.1021/ie50448a022
. [all data]
Domalski and Hearing, 1996
Domalski, Eugene S.; Hearing, Elizabeth D.,
Heat Capacities and Entropies of Organic Compounds in the Condensed Phase. Volume III,
J. Phys. Chem. Ref. Data, 1996, 25, 1, 1, https://doi.org/10.1063/1.555985
. [all data]
Hunter and Lias, 1998
Hunter, E.P.; Lias, S.G.,
Evaluated Gas Phase Basicities and Proton Affinities of Molecules: An Update,
J. Phys. Chem. Ref. Data, 1998, 27, 3, 413-656, https://doi.org/10.1063/1.556018
. [all data]
Beez, Bieri, et al., 1973
Beez, M.; Bieri, G.; Bock, H.; Heilbronner, E.,
The ionization potentials of butadiene, hexatriene, andtheir methyl derivatives: evidence for through space interaction between double bond π-orbitals and non-bonded pseudo-π orbitals of methyl groups?,
Helv. Chim. Acta, 1973, 56, 1028. [all data]
Parr and Elder, 1968
Parr, A.C.; Elder, F.A.,
Photoionization of 1,3butadiene, 1,2-butadiene, allene, and propyne,
J. Chem. Phys., 1968, 49, 2659. [all data]
Bieri, Burger, et al., 1977
Bieri, G.; Burger, F.; Heilbronner, E.; Maier, J.P.,
Valence ionization enrgies of hydrocarbons,
Helv. Chim. Acta, 1977, 60, 2213. [all data]
White, Carlson, et al., 1974
White, R.M.; Carlson, T.A.; Spears, D.P.,
Angular distribution of the photoelectron spectra for ethylene, propylene, butene and butadiene,
J. Electron Spectrosc. Relat. Phenom., 1974, 3, 59. [all data]
Brogli, Crandall, et al., 1973
Brogli, F.; Crandall, J.K.; Heilbronner, E.; Kloster-Jensen, E.; Sojka, S.A.,
The photoelectron spectra of methyl-substituted allenes and of tetramethyl-bisallenyl,
J. Electron Spectrosc. Relat. Phenom., 1973, 2, 455. [all data]
Collin and Lossing, 1957
Collin, J.; Lossing, F.P.,
Ionization and dissociation of allene, propyne, 1-butyne, and 1,2- and 1,3-butadienes by electron impact; the C3H3+ ion,
J. Am. Chem. Soc., 1957, 79, 5848. [all data]