2-Butene, (Z)-
- Formula: C4H8
- Molecular weight: 56.1063
- IUPAC Standard InChIKey: IAQRGUVFOMOMEM-ARJAWSKDSA-N
- CAS Registry Number: 590-18-1
- Chemical structure:
View 3d structure (requires JavaScript / HTML 5) - Stereoisomers:
- Other names: (Z)-2-Butene; cis-Butene; cis-2-Butylene; cis-1,2-Dimethylethylene; cis-2-Butene; (Z)-2-C4H8; (2Z)-2-Butene; 2-Butene, cis-; Butene-2, cis-; 2-Butene, (2Z)-; (Z)-but-2-ene

Gas phase thermochemistry data

Data compiled as indicated in comments:
ALS - Hussein Y. Afeefy, Joel F. Liebman, and Stephen E. Stein
GT - Glushko Thermocenter, Russian Academy of Sciences, Moscow
Quantity | Value | Units | Method | Reference | Comment |
---|---|---|---|---|---|
ΔfH°gas | -7.7 ± 1.3 | kJ/mol | Cm | Prosen, Maron, et al., 1951 | ALS |
Quantity | Value | Units | Method | Reference | Comment |
ΔcH°gas | -2709.8 ± 1.2 | kJ/mol | Cm | Prosen, Maron, et al., 1951 | Corresponding ΔfHºgas = -7.57 kJ/mol (simple calculation by NIST; no Washburn corrections); ALS |
Constant pressure heat capacity of gas
Cp,gas (J/mol*K) | Temperature (K) | Reference | Comment |
---|---|---|---|
45.01 | 50. | Thermodynamics Research Center, 1997 | p=1 bar. The difference between recommended values and obtained by [ Aston J.D., 1946] is inside the range of uncertainties of these two statistical calculations. The values of S and Cp calculated by [ Scott R.B., 1944] and [ Kilpatrick J.E., 1946] are little lower than recommended ones.; GT |
51.23 | 100. | ||
55.45 | 150. | ||
61.73 | 200. | ||
74.89 | 273.15 | ||
80.15 | 298.15 | ||
80.55 | 300. | ||
102.73 | 400. | ||
123.64 | 500. | ||
141.91 | 600. | ||
157.66 | 700. | ||
171.27 | 800. | ||
183.06 | 900. | ||
193.30 | 1000. | ||
202.18 | 1100. | ||
209.90 | 1200. | ||
216.59 | 1300. | ||
222.41 | 1400. | ||
227.48 | 1500. | ||
237.55 | 1750. | ||
244.85 | 2000. | ||
250.26 | 2250. | ||
254.33 | 2500. | ||
257.45 | 2750. | ||
259.87 | 3000. |
Constant pressure heat capacity of gas
Cp,gas (J/mol*K) | Temperature (K) | Reference | Comment |
---|---|---|---|
70.8 ± 1.6 | 250. | Scott R.B., 1944 | Please also see Kistiakowsky G.B., 1940.; GT |
71.1 ± 1.6 | 255. | ||
71.7 ± 1.7 | 260. | ||
72.3 ± 1.7 | 265. | ||
72.9 ± 1.7 | 270. | ||
73.9 ± 1.7 | 275. | ||
74.7 ± 1.7 | 280. | ||
75.9 ± 1.8 | 285. | ||
77.2 ± 1.8 | 290. | ||
78.5 ± 1.8 | 295. | ||
81.13 ± 0.16 | 298.58 | ||
79.9 ± 1.8 | 300. | ||
88.24 ± 0.18 | 332.85 | ||
96.27 ± 0.19 | 371.24 |

Reaction thermochemistry data

Data compiled by: Hussein Y. Afeefy, Joel F. Liebman, and Stephen E. Stein
Individual Reactions
By formula: C4H8 = C4H8
Quantity | Value | Units | Method | Reference | Comment |
---|---|---|---|---|---|
ΔrH° | -4. ± 2. | kJ/mol | AVG | N/A | Average of 7 values; Individual data points |
By formula: HBr + C4H8 = C4H9Br
Quantity | Value | Units | Method | Reference | Comment |
---|---|---|---|---|---|
ΔrH° | -77.07 ± 0.50 | kJ/mol | Cm | Lacher, Billings, et al., 1952 | gas phase; Reanalyzed by Cox and Pilcher, 1970, Original value = -76.8 ± 6.6 kJ/mol; Heat of Hydrobromination at 373 K |
Quantity | Value | Units | Method | Reference | Comment |
---|---|---|---|---|---|
ΔrH° | -118.5 ± 0.42 | kJ/mol | Chyd | Kistiakowsky, Ruhoff, et al., 1935 | gas phase; Reanalyzed by Cox and Pilcher, 1970, Original value = -119.54 ± 0.079 kJ/mol; At 355 °K |
By formula: C4H8 = C4H8
Quantity | Value | Units | Method | Reference | Comment |
---|---|---|---|---|---|
ΔrH° | -10.6 ± 2.1 | kJ/mol | Eqk | Happel, Hnatow, et al., 1971 | gas phase |
ΔrH° | -8.16 | kJ/mol | Ciso | Levanova and Andreevskii, 1964 | gas phase; At 420.3 K |
By formula: C4H8 + Br2 = C4H8Br2
Quantity | Value | Units | Method | Reference | Comment |
---|---|---|---|---|---|
ΔrH° | -126.3 ± 0.84 | kJ/mol | Cm | Conn, Kistiakowsky, et al., 1938 | gas phase; At 355 °K |
By formula: C4H9Cl = C4H8 + HCl
Quantity | Value | Units | Method | Reference | Comment |
---|---|---|---|---|---|
ΔrH° | 67.15 | kJ/mol | Eqk | Levanova and Andreevskii, 1964 | gas phase; At 420 K |

Gas phase ion energetics data

Data evaluated as indicated in comments:
L - Sharon G. Lias
Data compiled as indicated in comments:
LBLHLM - Sharon G. Lias, John E. Bartmess, Joel F. Liebman, John L. Holmes, Rhoda D. Levin, and W. Gary Mallard
LLK - Sharon G. Lias, Rhoda D. Levin, and Sherif A. Kafafi
RDSH - Henry M. Rosenstock, Keith Draxl, Bruce W. Steiner, and John T. Herron
Quantity | Value | Units | Method | Reference | Comment |
---|---|---|---|---|---|
IE (evaluated) | 9.11 ± 0.01 | eV | N/A | N/A | L |
Ionization energy determinations
IE (eV) | Method | Reference | Comment |
---|---|---|---|
9.13 | PI | Traeger, 1986 | LBLHLM |
9.13 | PI | Traeger, 1984 | LBLHLM |
9.11 ± 0.02 | PI | Wood and Taylor, 1979 | LLK |
9.108 ± 0.008 | EQ | Lias and Ausloos, 1978 | LLK |
9.12 ± 0.02 | PE | Bieri, Burger, et al., 1977 | LLK |
9.124 ± 0.005 | PE | Masclet, Grosjean, et al., 1973 | LLK |
9.10 | EI | Lossing, 1972 | LLK |
9.07 | PE | Frost and Sandhu, 1971 | LLK |
9.119 | S | McDiarmid, 1969 | RDSH |
9.12 | PE | Dewar and Worley, 1969 | RDSH |
9.13 ± 0.01 | PI | Watanabe, Nakayama, et al., 1962 | RDSH |
9.13 | PI | Bralsford, Harris, et al., 1960 | RDSH |
9.32 ± 0.01 | PE | Krause, Taylor, et al., 1978 | Vertical value; LLK |
9.20 | PE | Wiberg, Ellison, et al., 1976 | Vertical value; LLK |
9.11 ± 0.03 | PE | Heilbronner, Hoshi, et al., 1976 | Vertical value; LLK |
9.36 | PE | Kimura, Katsumata, et al., 1975 | Vertical value; LLK |
9.4 | PE | White, Carlson, et al., 1974 | Vertical value; LLK |
9.29 | PE | Robin, Taylor, et al., 1973 | Vertical value; LLK |
Appearance energy determinations
Ion | AE (eV) | Other Products | Method | Reference | Comment |
---|---|---|---|---|---|
C2H4+ | 11.7 ± 0.25 | ? | EI | Meisels, Park, et al., 1970 | RDSH |
C2H5+ | 12.25 | C2H3 | EI | Omura, 1961 | RDSH |
C3H3+ | 13.75 | ? | EI | Omura, 1961 | RDSH |
C3H5+ | 11.25 | CH3 | PI | Traeger, 1984 | LBLHLM |
C3H5+ | 11.33 | CH3 | EI | Lossing, 1971 | LLK |
C4H7+ | 11.19 | H | PI | Traeger, 1986 | LBLHLM |
C4H7+ | 11.32 | H | EI | Lossing, 1972 | LLK |

Condensed phase thermochemistry data

Data compiled by: Eugene S. Domalski and Elizabeth D. Hearing
Quantity | Value | Units | Method | Reference | Comment |
---|---|---|---|---|---|
S°liquid | 52.6 | cal/mol*K | N/A | Chao, Hall, et al., 1983 | |
S°liquid | 52.560 | cal/mol*K | N/A | Scott, Ferguson, et al., 1944 | |
S°liquid | 50.880 | cal/mol*K | N/A | Todd and Parks, 1936 | Extrapolation below 90 K, 48.95 J/mol*K. |
Constant pressure heat capacity of liquid
Cp,liquid (cal/mol*K) | Temperature (K) | Reference | Comment |
---|---|---|---|
30.4 | 298.15 | Chao, Hall, et al., 1983 | T = 5 to 367 K. |
31.071 | 299.8 | Schlinger and Sage, 1952 | T = 80 to 200°F. |
30.151 | 298.15 | Scott, Ferguson, et al., 1944 | T = 15 to 300 K. |
28.411 | 266.6 | Todd and Parks, 1936 | T = 93 to 267 K. Value is unsmoothed experimental datum. |

Phase change data

Data compiled as indicated in comments:
BS - Robert L. Brown and Stephen E. Stein
TRC - Thermodynamics Research Center, NIST Boulder Laboratories, Chris Muzny director
AC - William E. Acree, Jr., James S. Chickos
ALS - Hussein Y. Afeefy, Joel F. Liebman, and Stephen E. Stein
DH - Eugene S. Domalski and Elizabeth D. Hearing
Quantity | Value | Units | Method | Reference | Comment |
---|---|---|---|---|---|
Tboil | 276.84 ± 0.08 | K | AVG | N/A | Average of 7 values; Individual data points |
Quantity | Value | Units | Method | Reference | Comment |
Tfus | 133.85 | K | N/A | Kistiakowsky, Ruhoff, et al., 1935 | Uncertainty assigned by TRC = 0.5 K; TRC |
Quantity | Value | Units | Method | Reference | Comment |
Ttriple | 134.26 | K | N/A | Chao, Hall, et al., 1983, 2 | Uncertainty assigned by TRC = 0.02 K; TRC |
Ttriple | 134.26 | K | N/A | Scott, Ferguson, et al., 1944 | Uncertainty assigned by TRC = 0.02 K; TRC |
Ttriple | 133.8 | K | N/A | Todd and Parks, 1936, 2 | Uncertainty assigned by TRC = 0.2 K; TRC |
Quantity | Value | Units | Method | Reference | Comment |
Tc | 435.5 ± 0.1 | K | N/A | Tsonopoulos and Ambrose, 1996 | |
Tc | 435.6 | K | N/A | Majer and Svoboda, 1985 | |
Tc | 435.55 | K | N/A | Ambrose, Cox, et al., 1960 | Uncertainty assigned by TRC = 0.3 K; Visual, PRT, IPTS-48; TRC |
Quantity | Value | Units | Method | Reference | Comment |
Pc | 41.5 ± 0.5 | atm | N/A | Tsonopoulos and Ambrose, 1996 | |
Quantity | Value | Units | Method | Reference | Comment |
Vc | 0.2338 | l/mol | N/A | Tsonopoulos and Ambrose, 1996 | |
Quantity | Value | Units | Method | Reference | Comment |
ρc | 4.28 ± 0.05 | mol/l | N/A | Tsonopoulos and Ambrose, 1996 | |
Quantity | Value | Units | Method | Reference | Comment |
ΔvapH° | 5.43 | kcal/mol | N/A | Majer and Svoboda, 1985 | |
ΔvapH° | 5.28 | kcal/mol | N/A | Reid, 1972 | AC |
Enthalpy of vaporization
ΔvapH (kcal/mol) | Temperature (K) | Method | Reference | Comment |
---|---|---|---|---|
5.578 | 276.9 | N/A | Majer and Svoboda, 1985 | |
5.83 | 275. | A | Stephenson and Malanowski, 1987 | Based on data from 221. to 290. K.; AC |
5.74 | 291. | A | Stephenson and Malanowski, 1987 | Based on data from 276. to 325. K.; AC |
5.64 | 339. | A | Stephenson and Malanowski, 1987 | Based on data from 324. to 386. K.; AC |
5.64 | 398. | A | Stephenson and Malanowski, 1987 | Based on data from 383. to 431. K.; AC |
5.38 | 246. | C | Scott, Ferguson, et al., 1944, 2 | AC |
5.370 | 246. | C | Scott, Ferguson, et al., 1944 | ALS |
5.810 | 276.73 | V | Kistiakowsky, Ruhoff, et al., 1935, 2 | At 355 °K; ALS |
6.05 | 252. | N/A | Hopkins, 1921 | Based on data from 195. to 267. K. See also Boublik, Fried, et al., 1984.; AC |
Enthalpy of vaporization
ΔvapH =
A exp(-βTr) (1 − Tr)β
ΔvapH =
Enthalpy of vaporization (at saturation pressure)
(kcal/mol)
Tr = reduced temperature (T / Tc)
View plot Requires a JavaScript / HTML 5 canvas capable browser.
Temperature (K) | A (kcal/mol) | β | Tc (K) | Reference | Comment |
---|---|---|---|---|---|
246. to 292. | 8.693 | 0.2696 | 435.6 | Majer and Svoboda, 1985 |
Antoine Equation Parameters
log10(P) = A − (B / (T + C))
P = vapor pressure (atm)
T = temperature (K)
View plot Requires a JavaScript / HTML 5 canvas capable browser.
Temperature (K) | A | B | C | Reference | Comment |
---|---|---|---|---|---|
203.06 to 295.91 | 3.98173 | 957.06 | -36.504 | Scott, Ferguson, et al., 1944 | Coefficents calculated by NIST from author's data. |
Enthalpy of fusion
ΔfusH (kcal/mol) | Temperature (K) | Reference | Comment |
---|---|---|---|
1.747 | 134.26 | Chao, Hall, et al., 1983 | DH |
1.7469 | 134.26 | Scott, Ferguson, et al., 1944 | DH |
1.75 | 134.3 | Domalski and Hearing, 1996 | AC |
1.749 | 133.8 | Todd and Parks, 1936 | DH |
Entropy of fusion
ΔfusS (cal/mol*K) | Temperature (K) | Reference | Comment |
---|---|---|---|
13.0 | 134.26 | Chao, Hall, et al., 1983 | DH |
13.01 | 134.26 | Scott, Ferguson, et al., 1944 | DH |
13.07 | 133.8 | Todd and Parks, 1936 | DH |

Henry's Law data

Data compiled by: Rolf Sander
Henry's Law constant (water solution)
kH(T) = k°H exp(d(ln(kH))/d(1/T) ((1/T) - 1/(298.15 K)))
k°H = Henry's law constant for solubility in water at 298.15 K (mol/(kg*bar))
d(ln(kH))/d(1/T) = Temperature dependence constant (K)
k°H (mol/(kg*bar)) | d(ln(kH))/d(1/T) (K) | Method | Reference | Comment |
---|---|---|---|---|
0.0043 | X | N/A | Value given here as quoted by missing citation. |

Kovats' RI, non-polar column, isothermal

Data compiled by: NIST Mass Spectrometry Data Center, William E. Wallace, director

Column type CapillaryCapillaryCapillaryCapillaryCapillary
Active phase BPX-5CP Sil 5 CBSqualaneDB-1HP-PONA
Column length (m) 12.25.50.60.50.
Carrier gas H2H2 H2H2
Substrate
Column diameter (mm) 0.150.150.250.2640.21
Phase thickness (μm) 0.252. 0.250.5
Temperature (C) 30.20.50.40.40.
I 426.425.417.0425.425.
ReferenceAflalaye, Sternberg, et al., 1995Do and Raulin, 1992Papazova, Milina, et al., 1988Lubeck and Sutton, 1984Lubeck and Sutton, 1984
Comment MSDC-RI MSDC-RI MSDC-RI MSDC-RI MSDC-RI
Column type CapillaryCapillaryCapillaryCapillaryCapillary
Active phase OV-1SqualaneSqualaneSqualaneSqualane
Column length (m) 150.100.100.100.100.
Carrier gas He
Substrate
Column diameter (mm) 0.500.250.250.250.25
Phase thickness (μm)
Temperature (C) 20.50.70.50.70.
I 418.416.5416.5416.3416.5
ReferenceNijs and Jacobs, 1981Bajus, Veselý, et al., 1979Bajus, Veselý, et al., 1979Bajus, Veselý, et al., 1979, 2Bajus, Veselý, et al., 1979, 2
Comment MSDC-RI MSDC-RI MSDC-RI MSDC-RI MSDC-RI
Column type CapillaryPackedCapillaryCapillaryCapillary
Active phase SqualaneSqualaneSqualaneSqualaneSqualane
Column length (m) 50.  120.100.
Carrier gas N2  HeN2
Substrate
Column diameter (mm) 0.2  0.250.25
Phase thickness (μm) 0.5
Temperature (C) 50.80.50.100.50.
I 416.85417.417.427.3417.
ReferencePacáková and Koslík, 1978Chrétien and Dubois, 1977Chretien and Dubois, 1976Lulova, Leont'eva, et al., 1976Rijks and Cramers, 1974
Comment MSDC-RI MSDC-RI MSDC-RI MSDC-RI MSDC-RI
Column type CapillaryCapillaryPackedPackedPacked
Active phase SqualaneSqualaneSqualaneSqualaneSqualane
Column length (m) 100.91.415.15.15.
Carrier gas N2N2HeHeHe
Substrate   Chromosorb PChromosorb PChromosorb P
Column diameter (mm) 0.250.250.250.250.25
Phase thickness (μm)
Temperature (C) 70.40.27.49.67.
I 417.411.416.417.417.
ReferenceRijks and Cramers, 1974Matukuma, 1969Hively and Hinton, 1968Hively and Hinton, 1968Hively and Hinton, 1968
Comment MSDC-RI MSDC-RI MSDC-RI MSDC-RI MSDC-RI
Column type PackedPackedPacked
Active phase SqualaneSE-30SE-30
Column length (m) 15.7.97.9
Carrier gas He
Substrate Chromosorb PDiatoport SDiatoport S
Column diameter (mm) 0.25
Phase thickness (μm)
Temperature (C) 86.70.70.
I 418.427.427.
ReferenceHively and Hinton, 1968Widmer, 1967Widmer, 1967
Comment MSDC-RI MSDC-RI MSDC-RI

Normal alkane RI, non-polar column, temperature ramp

Data compiled by: NIST Mass Spectrometry Data Center, William E. Wallace, director

Column type CapillaryCapillaryCapillaryCapillaryCapillary
Active phase Polydimethyl siloxane: CP-Sil 5 CBPetrocol DHPONAOV-101SE-54
Column length (m) 60.100.50.52.50.
Carrier gas HeliumHeliumNitrogenN2
Substrate
Column diameter (mm) 0.250.250.200.260.32
Phase thickness (μm) 1.00.500.50
Tstart (C) 45.20.35.50.60.
Tend (C) 210.220.200.220.200.
Heat rate (K/min) 3.615.2.3.4.
Initial hold (min) 1.4515.15. 2.
Final hold (min) 2.7230.10.
I 422.426.416.420.416.
ReferenceBramston-Cook, 2013Supelco, 2012Zhang, Ding, et al., 2009Chupalov and Zenkevich, 1996Guan, Li, et al., 1995
Comment MSDC-RI MSDC-RI MSDC-RI MSDC-RI MSDC-RI
Column type Capillary
Active phase DB-1
Column length (m) 60.
Carrier gas He
Substrate
Column diameter (mm) 0.32
Phase thickness (μm) 1.2
Tstart (C) 30.
Tend (C) 240.
Heat rate (K/min) 3.
Initial hold (min) 10.
Final hold (min)
I 416.
ReferenceCiccioli, Cecinato, et al., 1992
Comment MSDC-RI

References

Prosen, Maron, et al., 1951
Prosen, E.J.; Maron, F.W.; Rossini, F.D.,
Heats of combustion, formation, and insomerization of ten C4 hydrocarbons,
J. Res. NBS, 1951, 46, 106-112. [all data]
Thermodynamics Research Center, 1997
Thermodynamics Research Center,
Selected Values of Properties of Chemical Compounds., Thermodynamics Research Center, Texas A&M University, College Station, Texas, 1997. [all data]
Aston J.D., 1946
Aston J.D.,
Thermodynamic properties of gaseous 1,3-butadiene and normal butenes above 25 C. Equilibria in the system 1,3-butadiene, n-butenes, and n-butane,
J. Chem. Phys., 1946, 14, 67-79. [all data]
Scott R.B., 1944
Scott R.B.,
Thermodynamic properties of cis-2-butene from 15 to 1500 K,
J. Res. Nat. Bur. Stand., 1944, 33, 1-20. [all data]
Kilpatrick J.E., 1946
Kilpatrick J.E.,
Heat content, free energy function, entropy, and heat capacity of ethylene, propylene, and the four butenes to 1500 K,
J. Res. Nat. Bur. Stand, 1946, 37, 163-171. [all data]
Kistiakowsky G.B., 1940
Kistiakowsky G.B.,
Gaseous heat capacities. III,
J. Chem. Phys., 1940, 8, 618-622. [all data]
Lacher, Billings, et al., 1952
Lacher, J.R.; Billings, T.J.; Campion, D.E.,
Vapor phase heats of hydrobromination of the isomeric butenes,
J. Am. Chem. Soc., 1952, 74, 5291-52. [all data]
Cox and Pilcher, 1970
Cox, J.D.; Pilcher, G.,
Thermochemistry of Organic and Organometallic Compounds, Academic Press, New York, 1970, 1-636. [all data]
Kistiakowsky, Ruhoff, et al., 1935
Kistiakowsky, G.B.; Ruhoff, J.R.; Smith, H.A.; Vaughan, W.E.,
Heats of organic reactions. II. Hydrogenation of some simpler olefinic hydrocarbons,
J. Am. Chem. Soc., 1935, 57, 876-882. [all data]
Happel, Hnatow, et al., 1971
Happel, J.; Hnatow, M.A.; Mezaki, R.,
Isomerization equilibrium constants of n-butenes,
J. Chem. Eng. Data, 1971, 16, 206-209. [all data]
Levanova and Andreevskii, 1964
Levanova, S.V.; Andreevskii, D.N.,
The equilibrium of 2-chlorobutane dehydrochlorination,
Neftekhimiya, 1964, 4, 329-336. [all data]
Conn, Kistiakowsky, et al., 1938
Conn, J.B.; Kistiakowsky, G.B.; Smith, E.A.,
Heats of organic reactions. VII. Addition of halogens to olefins,
J. Am. Chem. Soc., 1938, 60, 2764-2771. [all data]
Traeger, 1986
Traeger, J.C.,
Heat of formation for the 1-methylallyl cation by photoionization mass spectrometry,
J. Phys. Chem., 1986, 90, 4114. [all data]
Traeger, 1984
Traeger, J.C.,
A study of the allyl cation thermochemistry by photoionization mass spectrometry,
Int. J. Mass Spectrom. Ion Processes, 1984, 58, 259. [all data]
Wood and Taylor, 1979
Wood, K.V.; Taylor, J.W.,
A photoionization mass spectrometric study of autoionization in ethylene and trans-2-butene,
Int. J. Mass Spectrom. Ion Phys., 1979, 30, 307. [all data]
Lias and Ausloos, 1978
Lias, S.G.; Ausloos, P.J.,
eIonization energies of organic compounds by equilibrium measurements,
J. Am. Chem. Soc., 1978, 100, 6027. [all data]
Bieri, Burger, et al., 1977
Bieri, G.; Burger, F.; Heilbronner, E.; Maier, J.P.,
Valence ionization enrgies of hydrocarbons,
Helv. Chim. Acta, 1977, 60, 2213. [all data]
Masclet, Grosjean, et al., 1973
Masclet, P.; Grosjean, D.; Mouvier, G.,
Alkene ionization potentials. Part I. Quantitative determination of alkyl group structural effects,
J. Electron Spectrosc. Relat. Phenom., 1973, 2, 225. [all data]
Lossing, 1972
Lossing, F.P.,
Free radicals by mass spectrometry. XLV. Ionization potentials and heats of formation of C3H3, C3H5, and C4H7 radicals and ions,
Can. J. Chem., 1972, 50, 3973. [all data]
Frost and Sandhu, 1971
Frost, D.C.; Sandhu, J.S.,
Ionization potentials of ethylene and some methyl-substituted ethylenes as determined by photoelectron spectroscopy,
Indian J. Chem., 1971, 9, 1105. [all data]
McDiarmid, 1969
McDiarmid, R.,
Rydberg progressions in cis- and trans-butene,
J. Chem. Phys., 1969, 50, 2328. [all data]
Dewar and Worley, 1969
Dewar, M.J.S.; Worley, S.D.,
Photoelectron spectra of molecules. I. Ionization potentials of some organic molecules and their interpretation,
J. Chem. Phys., 1969, 50, 654. [all data]
Watanabe, Nakayama, et al., 1962
Watanabe, K.; Nakayama, T.; Mottl, J.,
Ionization potentials of some molecules,
J. Quant. Spectry. Radiative Transfer, 1962, 2, 369. [all data]
Bralsford, Harris, et al., 1960
Bralsford, R.; Harris, P.V.; Price, W.C.,
The effect of fluorine on the electronic spectra and ionization potentials of molecules,
Proc. Roy. Soc. (London), 1960, A258, 459. [all data]
Krause, Taylor, et al., 1978
Krause, D.A.; Taylor, J.W.; Fenske, R.F.,
An analysis of the effects of alkyl substituents on the ionization potentials of n-alkenes,
J. Am. Chem. Soc., 1978, 100, 718. [all data]
Wiberg, Ellison, et al., 1976
Wiberg, K.B.; Ellison, G.B.; Wendoloski, J.J.; Brundle, C.R.; Kuebler, N.A.,
Electronic states of organic molecules. 3. Photoelectron spectra of cycloalkenes and methylenecycloalkanes,
J. Am. Chem. Soc., 1976, 98, 7179. [all data]
Heilbronner, Hoshi, et al., 1976
Heilbronner, E.; Hoshi, T.; von Rosenberg, J.L.; Hafner, K.,
Alkyl-induced, natural hypsochromic shifts of the 2A←2X and 2B←2X transitions of azulene and naphthalene radical cations,
Nouv. J. Chim., 1976, 1, 105. [all data]
Kimura, Katsumata, et al., 1975
Kimura, K.; Katsumata, S.; Yamazaki, T.; Wakabayashi, H.,
UV photoelectron spectra and sum rule consideration; out-of-plane orbitals of unsaturated compounds with planar-skeleton structure,
J. Electron Spectrosc. Relat. Phenom., 1975, 6, 41. [all data]
White, Carlson, et al., 1974
White, R.M.; Carlson, T.A.; Spears, D.P.,
Angular distribution of the photoelectron spectra for ethylene, propylene, butene and butadiene,
J. Electron Spectrosc. Relat. Phenom., 1974, 3, 59. [all data]
Robin, Taylor, et al., 1973
Robin, M.B.; Taylor, G.N.; Kuebler, N.A.; Bach, R.D.,
Planarity of the carbon skeleton in various alkylated olefins,
J. Org. Chem., 1973, 38, 1049. [all data]
Meisels, Park, et al., 1970
Meisels, G.G.; Park, J.Y.; Giessner, B.G.,
Ionization and dissociation of C4H8 isomers,
J. Am. Chem. Soc., 1970, 92, 254. [all data]
Omura, 1961
Omura, I.,
Mass spectra at low ionizing voltage and bond dissociation energies of molecular ions from hydrocarbons,
Bull. Chem. Soc. Japan, 1961, 34, 1227. [all data]
Lossing, 1971
Lossing, F.P.,
Free radicals by mass spectrometry. XLIII. Ionization potentials and ionic heats of formation for vinyl, allyl, and benzyl radicals,
Can. J. Chem., 1971, 49, 357. [all data]