Ethene, 1,2-dibromo-, (E)-
- Formula: C2H2Br2
- Molecular weight: 185.845
- IUPAC Standard InChIKey: UWTUEMKLYAGTNQ-OWOJBTEDSA-N
- CAS Registry Number: 590-12-5
- Chemical structure:
View 3d structure (requires JavaScript / HTML 5) - Stereoisomers:
- Other names: (E)-1,2-Dibromoethylene; trans-1,2-Dibromoethene

Phase change data

Data compiled as indicated in comments:
AC - William E. Acree, Jr., James S. Chickos
Enthalpy of vaporization
ΔvapH (kJ/mol) | Temperature (K) | Method | Reference | Comment |
---|---|---|---|---|
35.2 | 310. | A | Stephenson and Malanowski, 1987 | Based on data from 277. to 344. K. See also Dykyj, 1970.; AC |
42.9 | 292. | N/A | Noyes, Noyes, et al., 1950 | Based on data from 277. to 343. K. See also Boublik, Fried, et al., 1984.; AC |
Antoine Equation Parameters
log10(P) = A − (B / (T + C))
P = vapor pressure (bar)
T = temperature (K)
View plot Requires a JavaScript / HTML 5 canvas capable browser.
Temperature (K) | A | B | C | Reference | Comment |
---|---|---|---|---|---|
276.99 to 343.6 | 2.13933 | 557.045 | -137.479 | Noyes, Noyes, et al., 1950 | Coefficents calculated by NIST from author's data. |

Reaction thermochemistry data

Data compiled by: Hussein Y. Afeefy, Joel F. Liebman, and Stephen E. Stein
Individual Reactions
By formula: C2H2Br2 = C2H2Br2
Quantity | Value | Units | Method | Reference | Comment |
---|---|---|---|---|---|
ΔrH° | -1.0 ± 1.4 | kJ/mol | Eqk | Craig, Piper, et al., 1971 | gas phase |
ΔrH° | 0.42 ± 0.67 | kJ/mol | Kin | Dowling, Puranik, et al., 1957 | gas phase |

Gas phase ion energetics data

Data compiled as indicated in comments:
LLK - Sharon G. Lias, Rhoda D. Levin, and Sherif A. Kafafi
RDSH - Henry M. Rosenstock, Keith Draxl, Bruce W. Steiner, and John T. Herron
Ionization energy determinations
IE (eV) | Method | Reference | Comment |
---|---|---|---|
9.47 ± 0.01 | S | Wittel, Felps, et al., 1976 | LLK |
9.55 ± 0.01 | S | Schander and Russell, 1976 | LLK |
9.30 ± 0.02 | PE | Chadwick, Frost, et al., 1972 | LLK |
9.46 ± 0.02 | PI | Momigny, 1960 | RDSH |
9.47 | PI | Bralsford, Harris, et al., 1960 | RDSH |
9.55 | PE | Wittel and Bock, 1974 | Vertical value; LLK |
9.56 | PE | Bock and Wittel, 1972 | Vertical value; LLK |
Appearance energy determinations
Ion | AE (eV) | Other Products | Method | Reference | Comment |
---|---|---|---|---|---|
C2H2Br+ | 11.65 ± 0.05 | Br | EI | Momigny, 1961 | RDSH |

Kovats' RI, non-polar column, isothermal

Column type | Active phase | Temperature (C) | I | Reference | Comment |
---|---|---|---|---|---|
Packed | OV-1 | 100. | 738. | Castello and Gerbino, 1988 | He, Chromosorb W DMCS; Column length: 3. m |
Packed | OV-1 | 125. | 744. | Castello and Gerbino, 1988 | He, Chromosorb W DMCS; Column length: 3. m |
Packed | OV-1 | 75. | 730. | Castello and Gerbino, 1988 | He, Chromosorb W DMCS; Column length: 3. m |

Kovats' RI, polar column, isothermal

Column type | Active phase | Temperature (C) | I | Reference | Comment |
---|---|---|---|---|---|
Packed | SP-1000 | 100. | 1150.25 | Castello and Gerbino, 1988 | He, Chromosorb W DMCS; Column length: 3. m |
Packed | SP-1000 | 125. | 1157.92 | Castello and Gerbino, 1988 | He, Chromosorb W DMCS; Column length: 3. m |
Packed | SP-1000 | 75. | 1139.04 | Castello and Gerbino, 1988 | He, Chromosorb W DMCS; Column length: 3. m |

Normal alkane RI, non-polar column, custom temperature program

Column type | Active phase | I | Reference | Comment |
---|---|---|---|---|
Capillary | OV-1, SE-30, Methyl silicone, SP-2100, OV-101, DB-1, etc. | 756. | Waggott and Davies, 1984 | Hydrogen; Column length: 50. m; Column diameter: 0.32 mm; Program: not specified |

References

Stephenson and Malanowski, 1987
Stephenson, Richard M.; Malanowski, Stanislaw,
Handbook of the Thermodynamics of Organic Compounds, 1987, https://doi.org/10.1007/978-94-009-3173-2
. [all data]
Dykyj, 1970
Dykyj, J.,
Petrochemica, 1970, 10, 2, 51. [all data]
Noyes, Noyes, et al., 1950
Noyes, Richard M.; Noyes, Winninette A.; Steinmetz, Hyman,
Vapor Pressures of cis and trans Disubstituted Ethylenes,
J. Am. Chem. Soc., 1950, 72, 1, 33-34, https://doi.org/10.1021/ja01157a008
. [all data]
Boublik, Fried, et al., 1984
Boublik, T.; Fried, V.; Hala, E.,
The Vapour Pressures of Pure Substances: Selected Values of the Temperature Dependence of the Vapour Pressures of Some Pure Substances in the Normal and Low Pressure Region, 2nd ed., Elsevier, New York, 1984, 972. [all data]
Craig, Piper, et al., 1971
Craig, N.C.; Piper, L.G.; Wheeler, V.L.,
Thermodynamics of cis-trans isomerizations. II. The 1-chloro-2-fluoroethylenes, 1,2-difluorocyclopropanes, and related molecules,
J. Phys. Chem., 1971, 75, 1453-1460. [all data]
Dowling, Puranik, et al., 1957
Dowling, J.M.; Puranik, P.G.; Meister, A.G.,
Vibrational spectra, potential constants, and calculated thermodynamic properties of cis- and trans-BrHC=CHBr, and cis- and trans-BrDC=CDBr,
J. Chem. Phys., 1957, 26, 233-240. [all data]
Wittel, Felps, et al., 1976
Wittel, K.; Felps, W.S.; Klasinc, L.; McGlynn, S.P.,
Molecular Rydberg transitions. VI. trans-dibromoethylene. The relation between vacuum ultraviolet and photoelectron spectroscopy,
J. Chem. Phys., 1976, 65, 3698. [all data]
Schander and Russell, 1976
Schander, J.; Russell, B.R.,
Vacuum ultraviolet spectra of bromoethylene and dibromoethylenes,
J. Am. Chem. Soc., 1976, 98, 6900. [all data]
Chadwick, Frost, et al., 1972
Chadwick, D.; Frost, D.C.; Katrib, A.; McDowell, C.A.; McLean, R.A.N.,
Photoelectron spectra of some bromoethylenes and 2-bromopropene,
Can. J. Chem., 1972, 50, 2642. [all data]
Momigny, 1960
Momigny, J.,
Les potentials d'ionisation des dihalogenoethylenes cis et trans,
Bull. Classe Sci. Acad. Roy. Belg., 1960, 46, 686. [all data]
Bralsford, Harris, et al., 1960
Bralsford, R.; Harris, P.V.; Price, W.C.,
The effect of fluorine on the electronic spectra and ionization potentials of molecules,
Proc. Roy. Soc. (London), 1960, A258, 459. [all data]
Wittel and Bock, 1974
Wittel, K.; Bock, H.,
Photoelektronenspekten und molekuleigenschaften. XXVII. Chlor- und bromathylene- beispiele fur anderungen in π- und σ-Systemen,
Chem. Ber., 1974, 107, 317. [all data]
Bock and Wittel, 1972
Bock, H.; Wittel, K.,
Photoelectron spectra and molecular properties of trans-dihalogenoethylenes: substituent effects spin-orbit coupling,
J. Chem. Soc., Chem. Commun., 1972, 602. [all data]
Momigny, 1961
Momigny, J.,
Comportement des dihalogenoethylenes cis et trans sous l'impact electronique,
Bull. Soc. Chim. Belges, 1961, 70, 241. [all data]
Perkampus and Braunschweig, 1966
Perkampus, H.-H.; Braunschweig, T.H.,
UV atlas of organic compounds, 1966, 1, A1/19. [all data]
Castello and Gerbino, 1988
Castello, G.; Gerbino, T.C.,
Effect of Temperature on the Gas Chromatographic Separation of Halogenated Compounds on Polar and Non-Polar Stationary Phases,
J. Chromatogr., 1988, 437, 33-45, https://doi.org/10.1016/S0021-9673(00)90369-8
. [all data]
Waggott and Davies, 1984
Waggott, A.; Davies, I.W.,
Identification of organic pollutants using linear temperature programmed retention indices (LTPRIs) - Part II, 1984, retrieved from http://dwi.defra.gov.uk/research/completed-research/reports/dwi0383.pdf. [all data]