3-Hexanone
- Formula: C6H12O
- Molecular weight: 100.1589
- IUPAC Standard InChIKey: PFCHFHIRKBAQGU-UHFFFAOYSA-N
- CAS Registry Number: 589-38-8
- Chemical structure:
View 3d structure (requires JavaScript / HTML 5) - Other names: Ethyl propyl ketone; Hexan-3-one; n-C3H7COC2H5; Hexanone-(3); Aethylpropylketon; Ethyl n-propyl ketone

Gas phase thermochemistry data

Data compiled as indicated in comments:
ALS - Hussein Y. Afeefy, Joel F. Liebman, and Stephen E. Stein
GT - Glushko Thermocenter, Russian Academy of Sciences, Moscow
Quantity | Value | Units | Method | Reference | Comment |
---|---|---|---|---|---|
ΔfH°gas | -278.25 ± 0.89 | kJ/mol | Ccb | Harrop, Head, et al., 1970 | ALS |
Quantity | Value | Units | Method | Reference | Comment |
S°gas | 409.6 | J/mol*K | N/A | Andon R.J.L., 1970 | GT |
Constant pressure heat capacity of gas
Cp,gas (J/mol*K) | Temperature (K) | Reference | Comment |
---|---|---|---|
178.45 | 383.15 | Hales J.L., 1967 | GT |
185.14 | 403.15 | ||
191.92 | 423.15 | ||
200.41 | 448.15 | ||
208.03 | 473.15 | ||
215.81 | 498.15 |

Reaction thermochemistry data

Data compiled by: Michael M. Meot-Ner (Mautner) and Sharon G. Lias
Individual Reactions
By formula: CH6N+ + C6H12O = (CH6N+ • C6H12O)
Bond type: Hydrogen bonds of the type NH+-O between organics
Quantity | Value | Units | Method | Reference | Comment |
---|---|---|---|---|---|
ΔrH° | 113. | kJ/mol | PHPMS | Meot-Ner, 1984 | gas phase |
Quantity | Value | Units | Method | Reference | Comment |
ΔrS° | 113. | J/mol*K | PHPMS | Meot-Ner, 1984 | gas phase |

Gas phase ion energetics data

Data evaluated as indicated in comments:
HL - Edward P. Hunter and Sharon G. Lias
Data compiled as indicated in comments:
LLK - Sharon G. Lias, Rhoda D. Levin, and Sherif A. Kafafi
RDSH - Henry M. Rosenstock, Keith Draxl, Bruce W. Steiner, and John T. Herron
Quantity | Value | Units | Method | Reference | Comment |
---|---|---|---|---|---|
Proton affinity (review) | 843.2 | kJ/mol | N/A | Hunter and Lias, 1998 | HL |
Quantity | Value | Units | Method | Reference | Comment |
Gas basicity | 811.3 | kJ/mol | N/A | Hunter and Lias, 1998 | HL |
Ionization energy determinations
IE (eV) | Method | Reference | Comment |
---|---|---|---|
9.30 | EI | Holmes, Fingas, et al., 1981 | LLK |
9.12 ± 0.02 | PE | Ashmore and Burgess, 1978 | LLK |
Appearance energy determinations
Ion | AE (eV) | Other Products | Method | Reference | Comment |
---|---|---|---|---|---|
C4H7O+ | 10.6 ± 0.3 | C2H5 | EI | Yeo and Williams, 1969 | RDSH |
C4H8O+ | 9.89 | C2H4 | EI | Holmes and Lossing, 1980 | LLK |
C4H8O+ | 10.2 ± 0.3 | C2H4 | EI | Yeo and Williams, 1969 | RDSH |

Ion clustering data

Data compiled by: Michael M. Meot-Ner (Mautner) and Sharon G. Lias
Clustering reactions
By formula: CH6N+ + C6H12O = (CH6N+ • C6H12O)
Bond type: Hydrogen bonds of the type NH+-O between organics
Quantity | Value | Units | Method | Reference | Comment |
---|---|---|---|---|---|
ΔrH° | 113. | kJ/mol | PHPMS | Meot-Ner, 1984 | gas phase |
Quantity | Value | Units | Method | Reference | Comment |
ΔrS° | 113. | J/mol*K | PHPMS | Meot-Ner, 1984 | gas phase |

Condensed phase thermochemistry data

Data compiled as indicated in comments:
ALS - Hussein Y. Afeefy, Joel F. Liebman, and Stephen E. Stein
DH - Eugene S. Domalski and Elizabeth D. Hearing
Quantity | Value | Units | Method | Reference | Comment |
---|---|---|---|---|---|
ΔfH°liquid | -76.51 ± 0.21 | kcal/mol | Ccb | Harrop, Head, et al., 1970 | ALS |
Quantity | Value | Units | Method | Reference | Comment |
ΔcH°liquid | -897.68 ± 0.19 | kcal/mol | Ccb | Harrop, Head, et al., 1970 | Corresponding ΔfHºliquid = -76.515 kcal/mol (simple calculation by NIST; no Washburn corrections); ALS |
Quantity | Value | Units | Method | Reference | Comment |
S°liquid | 72.97 | cal/mol*K | N/A | Andon, Counsell, et al., 1970 | DH |
Constant pressure heat capacity of liquid
Cp,liquid (cal/mol*K) | Temperature (K) | Reference | Comment |
---|---|---|---|
51.84 | 298.15 | Andon, Counsell, et al., 1970 | T = 10 to 320 K.; DH |
51.70 | 298.15 | Harrop, Head, et al., 1970 | DH |

Phase change data

Data compiled as indicated in comments:
BS - Robert L. Brown and Stephen E. Stein
TRC - Thermodynamics Research Center, NIST Boulder Laboratories, Chris Muzny director
ALS - Hussein Y. Afeefy, Joel F. Liebman, and Stephen E. Stein
AC - William E. Acree, Jr., James S. Chickos
CAL - James S. Chickos, William E. Acree, Jr., Joel F. Liebman, Students of Chem 202 (Introduction to the Literature of Chemistry), University of Missouri -- St. Louis
DH - Eugene S. Domalski and Elizabeth D. Hearing
Quantity | Value | Units | Method | Reference | Comment |
---|---|---|---|---|---|
Tboil | 396. ± 1. | K | AVG | N/A | Average of 22 values; Individual data points |
Quantity | Value | Units | Method | Reference | Comment |
Tfus | 217.48 | K | N/A | Collerson, Counsell, et al., 1965 | Uncertainty assigned by TRC = 0.02 K; TRC |
Tfus | 217.5 | K | N/A | Collerson, Counsell, et al., 1965 | Uncertainty assigned by TRC = 0.01 K; TRC |
Quantity | Value | Units | Method | Reference | Comment |
Ttriple | 217.72 | K | N/A | Andon, Counsell, et al., 1970, 2 | Crystal phase 1 phase; Uncertainty assigned by TRC = 0.05 K; TRC |
Quantity | Value | Units | Method | Reference | Comment |
Tc | 583.2 | K | N/A | Pulliam, Gude, et al., 1994 | Uncertainty assigned by TRC = 0.25 K; by the sealed ampule method; TRC |
Tc | 582.8 | K | N/A | Majer and Svoboda, 1985 | |
Tc | 582.82 | K | N/A | Ambrose, Broderick, et al., 1974 | Uncertainty assigned by TRC = 0.4 K; TRC |
Quantity | Value | Units | Method | Reference | Comment |
Pc | 32.77 | atm | N/A | Ambrose, Broderick, et al., 1974 | Uncertainty assigned by TRC = 0.20 atm; TRC |
Quantity | Value | Units | Method | Reference | Comment |
ρc | 2.65 | mol/l | N/A | Pulliam, Gude, et al., 1994 | Uncertainty assigned by TRC = 0.03 mol/l; TRC |
Quantity | Value | Units | Method | Reference | Comment |
ΔvapH° | 10.0 ± 0.3 | kcal/mol | AVG | N/A | Average of 6 values; Individual data points |
Enthalpy of vaporization
ΔvapH (kcal/mol) | Temperature (K) | Method | Reference | Comment |
---|---|---|---|---|
8.451 | 396.7 | N/A | Majer and Svoboda, 1985 | |
8.72 | 423. | A | Stephenson and Malanowski, 1987 | Based on data from 408. to 517. K.; AC |
8.46 | 526. | A | Stephenson and Malanowski, 1987 | Based on data from 511. to 583. K.; AC |
9.30 | 363. | A | Stephenson and Malanowski, 1987 | Based on data from 348. to 413. K. See also Ambrose, Ellender, et al., 1975.; AC |
10.1 | 307. | A | Stephenson and Malanowski, 1987 | Based on data from 292. to 406. K. See also Dykyj, 1972.; AC |
9.18 ± 0.02 | 354. | C | Hales, Lees, et al., 1967 | AC |
8.84 ± 0.02 | 374. | C | Hales, Lees, et al., 1967 | AC |
8.46 ± 0.02 | 396. | C | Hales, Lees, et al., 1967 | AC |
9.27 | 364. | GS,EB | Collerson, Counsell, et al., 1965 | Based on data from 349. to 406. K.; AC |
Enthalpy of vaporization
ΔvapH =
A exp(-βTr) (1 − Tr)β
ΔvapH =
Enthalpy of vaporization (at saturation pressure)
(kcal/mol)
Tr = reduced temperature (T / Tc)
View plot Requires a JavaScript / HTML 5 canvas capable browser.
Temperature (K) | A (kcal/mol) | β | Tc (K) | Reference | Comment |
---|---|---|---|---|---|
298. to 397. | 14.83 | 0.3088 | 582.8 | Majer and Svoboda, 1985 |
Antoine Equation Parameters
log10(P) = A − (B / (T + C))
P = vapor pressure (atm)
T = temperature (K)
View plot Requires a JavaScript / HTML 5 canvas capable browser.
Temperature (K) | A | B | C | Reference |
---|---|---|---|---|
348.76 to 406.51 | 4.12002 | 1365.798 | -65.143 | Collerson, Counsell, et al., 1965, 2 |
Enthalpy of fusion
ΔfusH (kcal/mol) | Temperature (K) | Reference | Comment |
---|---|---|---|
3.219 | 217.7 | Domalski and Hearing, 1996 | AC |
Entropy of fusion
ΔfusS (cal/mol*K) | Temperature (K) | Reference | Comment |
---|---|---|---|
1.1 | 145. | Domalski and Hearing, 1996 | CAL |
14.79 | 217.7 |
Enthalpy of phase transition
ΔHtrs (kcal/mol) | Temperature (K) | Initial Phase | Final Phase | Reference | Comment |
---|---|---|---|---|---|
0.163 | 145. | crystaline, II | crystaline, I | Andon, Counsell, et al., 1970 | DH |
3.2242 | 217.72 | crystaline, I | liquid | Andon, Counsell, et al., 1970 | DH |
Entropy of phase transition
ΔStrs (cal/mol*K) | Temperature (K) | Initial Phase | Final Phase | Reference | Comment |
---|---|---|---|---|---|
1.13 | 145. | crystaline, II | crystaline, I | Andon, Counsell, et al., 1970 | DH |
14.81 | 217.72 | crystaline, I | liquid | Andon, Counsell, et al., 1970 | DH |

Normal alkane RI, polar column, temperature ramp

Data compiled by: NIST Mass Spectrometry Data Center, William E. Wallace, director

Column type CapillaryCapillaryCapillaryCapillaryCapillary
Active phase DB-WaxDB-WaxFFAPCarbowax 20MHP-Wax
Column length (m) 30.30.30.50.60.
Carrier gas HydrogenHeN2HeliumHe
Substrate
Column diameter (mm) 0.250.250.320.700.25
Phase thickness (μm) 0.250.250.5 0.5
Tstart (C) 30.30.35.50.40.
Tend (C) 230.210.320.280.190.
Heat rate (K/min) 8.5.4.4.3.
Initial hold (min) 5. 5.2.6.
Final hold (min) 10. 45.
I 1047.1058.1060.1027.1053.
ReferenceKarlsson, Birgersson, et al., 2009Kumazawa, Itobe, et al., 2008Nebesny, Budryn, et al., 2007Saura, LAencina, et al., 2003Sanz, Maeztu, et al., 2002
Comment MSDC-RI MSDC-RI MSDC-RI MSDC-RI MSDC-RI
Column type CapillaryCapillaryCapillaryCapillaryCapillary
Active phase HP-WaxHP-WaxDB-WaxDB-WaxDB-Wax
Column length (m) 60.60.30.60.60.
Carrier gas HeHe HeHe
Substrate
Column diameter (mm) 0.250.250.530.250.25
Phase thickness (μm) 0.50.5 1.
Tstart (C) 40.40.60.50.40.
Tend (C) 190.190.210.200.200.
Heat rate (K/min) 3.3.4.3.2.
Initial hold (min) 6.6.  2.
Final hold (min)    40.
I 1053.1053.1057.1042.1050.
ReferenceMaeztu, Sanz, et al., 2001Sanz, Ansorena, et al., 2001Iwatsuki, Mizota, et al., 1999Horiuchi, Umano, et al., 1998Umano, Hagi, et al., 1995
Comment MSDC-RI MSDC-RI MSDC-RI MSDC-RI MSDC-RI
Column type Capillary
Active phase Carbowax 20M
Column length (m) 80.
Carrier gas
Substrate
Column diameter (mm) 0.2
Phase thickness (μm)
Tstart (C) 70.
Tend (C) 170.
Heat rate (K/min) 2.
Initial hold (min)
Final hold (min)
I 1055.
ReferenceAnker, Jurs, et al., 1990
Comment MSDC-RI

Van Den Dool and Kratz RI, non-polar column, custom temperature program

Data compiled by: NIST Mass Spectrometry Data Center, William E. Wallace, director

Column type CapillaryCapillaryCapillaryCapillaryCapillary
Active phase VF-5MSHP-5CP Sil 8 CBCP Sil 8 CBBPX-5
Column length (m) 30.50.60.60.50.
Carrier gas HeHeHe He
Substrate
Column diameter (mm) 0.250.20.250.250.32
Phase thickness (μm) 0.250.50.250.250.5
Program Multi-step temperature program; T(initial)=60C; T(final)=270C40C(3min) => 10C/min => 60C =3C/min => 150C => 20C/min => 250C (5min)0C => rapidly => 40C(8min) => 4C/min => 250C(10min)0C => rapidly => 40C(8min) => 4C/min => 250C(10min)0C(5min) => 40C/min => 40C(2min) => 4C/min => 280C
I 785.5791.790.795.802.
ReferenceTret'yakov, 2007Boué, Shih, et al., 2003Oruna-Concha, Bakker, et al., 2002Duckham, Dodson, et al., 2001Elmore, Mottram, et al., 1999
Comment MSDC-RI MSDC-RI MSDC-RI MSDC-RI MSDC-RI

Kovats' RI, polar column, isothermal

Data compiled by: NIST Mass Spectrometry Data Center, William E. Wallace, director

Column type CapillaryCapillaryCapillaryCapillaryCapillary
Active phase HP-InnowaxHP-InnowaxHP-InnowaxHP-InnowaxPEG-20M
Column length (m) 30.30.30.30.50.
Carrier gas     He
Substrate
Column diameter (mm) 0.320.320.320.320.2
Phase thickness (μm) 0.50.50.50.50.13
Temperature (C) 110.50.70.90.80.
I 1084.51068.01073.31078.91050.0
ReferenceHéberger and Görgényi, 1999Héberger and Görgényi, 1999Héberger and Görgényi, 1999Héberger and Görgényi, 1999Orav, Kuningas, et al., 1994
Comment MSDC-RI MSDC-RI MSDC-RI MSDC-RI MSDC-RI
Column type Capillary
Active phase PEG-20M
Column length (m) 50.
Carrier gas He
Substrate
Column diameter (mm) 0.2
Phase thickness (μm) 0.22
Temperature (C) 80.
I 1065.0
ReferenceOrav, Kuningas, et al., 1994
Comment MSDC-RI

Kovats' RI, non-polar column, isothermal

View large format table.

Column type Active phase Temperature (C) I Reference Comment
CapillaryOV-1333.764.8Hu, Lu, et al., 2006
CapillaryHP-1110.765.97Héberger, Görgényi, et al., 200250. m/0.32 mm/1.05 μm
CapillaryHP-130.764.11Héberger, Görgényi, et al., 200250. m/0.32 mm/1.05 μm
CapillaryHP-150.764.10Héberger, Görgényi, et al., 200250. m/0.32 mm/1.05 μm
CapillaryHP-170.764.37Héberger, Görgényi, et al., 200250. m/0.32 mm/1.05 μm
CapillaryHP-190.765.00Héberger, Görgényi, et al., 200250. m/0.32 mm/1.05 μm
CapillaryHP-1110.766.Héberger and Görgényi, 199950. m/0.32 mm/1.05 μm, N2
CapillaryHP-150.764.Héberger and Görgényi, 199950. m/0.32 mm/1.05 μm, N2
CapillaryHP-170.764.Héberger and Görgényi, 199950. m/0.32 mm/1.05 μm, N2
CapillaryHP-190.765.Héberger and Görgényi, 199950. m/0.32 mm/1.05 μm, N2
PackedSE-30100.768.Winskowski, 1983Gaschrom Q; Column length: 2. m
PackedApiezon L120.750.Bogoslovsky, Anvaer, et al., 1978Celite 545
PackedApiezon L160.761.Bogoslovsky, Anvaer, et al., 1978Celite 545
PackedApiezon L130.746.Bogoslovsky, Anvaer, et al., 1978
PackedApiezon L130.746.Wehrli and Kováts, 1959Celite; Column length: 2.25 m
PackedApiezon L190.751.Wehrli and Kováts, 1959Celite; Column length: 2.25 m

Van Den Dool and Kratz RI, non-polar column, temperature ramp

View large format table.

Column type Active phase I Reference Comment
CapillaryDB-1757.4Sun and Stremple, 200330. m/0.25 mm/0.25 μm, He, 3. K/min; Tstart: 40. C; Tend: 325. C
CapillaryDB-5783.3Xu, van Stee, et al., 200330. m/0.25 mm/1. μm, He, 2.5 K/min; Tstart: 50. C; Tend: 200. C
CapillaryCP Sil 5 CB756.Pino and Marbot, 200150. m/0.32 mm/0.4 μm, He, 60. C @ 10. min, 3. K/min, 280. C @ 60. min
CapillaryCP Sil 5 CB756.Pino, Marbot, et al., 200150. m/0.32 mm/0.4 μm, He, 60. C @ 10. min, 3. K/min, 280. C @ 60. min
CapillaryDB-5784.Gómez, Ledbetter, et al., 1993He, 4. K/min; Column length: 30. m; Column diameter: 0.25 mm; Tstart: 50. C; Tend: 250. C

Van Den Dool and Kratz RI, polar column, temperature ramp

View large format table.

Column type Active phase I Reference Comment
CapillaryZB-Wax1023.Ledauphin, Basset, et al., 200630. m/0.25 mm/0.15 μm, He, 35. C @ 5. min, 5. K/min, 220. C @ 10. min
CapillaryCP-Wax 52CB1051.Mahadevan and Farmer, 200660. C @ 5. min, 4. K/min, 220. C @ 30. min; Column length: 50. m; Column diameter: 0.32 mm
CapillarySupelcowax-101053.Chung, Yung, et al., 200260. m/0.25 mm/0.25 μm, He, 35. C @ 5. min, 2. K/min, 195. C @ 90. min
CapillarySupelcowax-101053.Chung, Yung, et al., 200160. m/0.25 mm/0.25 μm, He, 35. C @ 5. min, 2. K/min, 195. C @ 90. min
CapillaryAT-Wax1040.Pino and Marbot, 200160. m/0.32 mm/0.25 μm, He, 65. C @ 10. min, 2. K/min, 250. C @ 60. min
CapillaryAT-Wax1037.Pino, Marbot, et al., 200160. m/0.32 mm/0.25 μm, He, 65. C @ 10. min, 2. K/min, 250. C @ 60. min
CapillarySupelcowax-101053.Chung, 199960. m/0.25 mm/0.25 μm, He, 35. C @ 5. min, 2. K/min, 195. C @ 90. min
CapillaryDB-Wax1046.Chung, Eiserich, et al., 1994He, 60. C @ 4. min, 3. K/min, 220. C @ 30. min; Column length: 60. m; Column diameter: 0.25 mm
CapillarySupelcowax-101053.Chung and Cadwallader, 199360. m/0.25 mm/0.25 μm, He, 40. C @ 5. min, 2. K/min, 195. C @ 40. min
CapillarySupelcowax-101053.Matiella and Hsieh, 199060. m/0.25 mm/0.25 μm, 40. C @ 5. min, 2. K/min, 175. C @ 20. min
CapillarySupelcowax-101054.Tanchotikul and Hsieh, 198960. m/0.25 mm/0.25 μm, 40. C @ 5. min, 2. K/min, 175. C @ 20. min
CapillarySupelcowax-101056.Tanchotikul and Hsieh, 198960. m/0.25 mm/0.25 μm, 40. C @ 5. min, 2. K/min, 175. C @ 20. min

Van Den Dool and Kratz RI, polar column, custom temperature program

View large format table.

Column type Active phase I Reference Comment
CapillarySupelcowax-101052.Bianchi, Careri, et al., 200730. m/0.25 mm/0.25 μm, He; Program: 35C(8min) => 4C/min => 60C => 6C/min => 160C => 20C/min => 200C(1min)

Normal alkane RI, non-polar column, isothermal

View large format table.

Column type Active phase Temperature (C) I Reference Comment
CapillaryOV-160.764.Amboni, Junkes, et al., 2002
PackedApieson L120.757.Kurdina, Markovich, et al., 1969not specified, not specified

Normal alkane RI, non-polar column, temperature ramp

View large format table.

Column type Active phase I Reference Comment
CapillaryOV-101771.Zenkevich, Eliseenkov, et al., 201125. m/0.20 mm/0.25 μm, Nitrogen, 6. K/min; Tstart: 40. C; Tend: 240. C
CapillaryDB-1760.Kumazawa, Itobe, et al., 200830. m/0.25 mm/0.25 μm, He, 5. K/min; Tstart: 30. C; Tend: 210. C
CapillaryHP-5786.Isidorov, Purzynska, et al., 200630. m/0.25 mm/0.25 μm, He, 35. C @ 5. min, 3. K/min; Tend: 200. C
CapillaryMDN-5783.van Loon, Linssen, et al., 200560. m/0.25 mm/0.25 μm, He, 40. C @ 4. min, 4. K/min, 270. C @ 5. min
CapillaryDB-5783.Joffraud, Leroi, et al., 200160. m/0.32 mm/1. μm, He, 40. C @ 5. min, 3. K/min; Tend: 200. C
CapillaryHP-5795.Boylston and Viniyard, 199850. m/0.32 mm/0.52 μm, 35. C @ 15. min, 2. K/min, 250. C @ 45. min
CapillaryDB-1771.Tai and Ho, 199860. m/0.32 mm/1.0 μm, He, 2. K/min; Tstart: 40. C; Tend: 280. C
CapillaryHP-5784.Larsen and Frisvad, 199535. C @ 2. min, 6. K/min; Tend: 200. C
CapillaryCross-Linked Methylsilicone761.Bravo and Hotchkiss, 1993He, 35. C @ 3. min, 4. K/min; Column length: 25. m; Column diameter: 0.32 mm; Tend: 225. C
CapillaryUltra-2768.King, Hamilton, et al., 199350. m/0.32 mm/0.52 μm, He, 40. C @ 3. min, 4. K/min, 250. C @ 30. min
CapillaryDB-5788.Macku and Shibamoto, 1991He, 40. C @ 5. min, 2. K/min; Column length: 60. m; Column diameter: 0.25 mm; Tend: 160. C
CapillaryDB-5788.Macku and Shibamoto, 1991, 2He, 40. C @ 5. min, 2. K/min; Column length: 60. m; Column diameter: 0.25 mm; Tend: 160. C
CapillaryOV-101775.Zenkevich and Ventura, 1991Helium, 50. C @ 0. min, 5. K/min, 240. C @ 0. min; Column length: 54. m; Column diameter: 0.26 mm
CapillaryOV-101767.Anker, Jurs, et al., 19902. K/min; Column length: 50. m; Column diameter: 0.28 mm; Tstart: 80. C; Tend: 200. C

Normal alkane RI, non-polar column, custom temperature program

View large format table.

Column type Active phase I Reference Comment
CapillaryTR-5 MS795.Kurashov, Mitrukova, et al., 201415. m/0.25 mm/0.25 μm, Helium; Program: 35 0C (3 min) 2 0C/min -> 60 0C (3 min) 2 0C/min -> 80 0C (3 min) 4 0C/min -> 120 0C (3 min) 5 0C/min -> 150 0C (3 min) 15 0C/min -> 240 0C (10 min)
CapillaryMethyl Silicone746.Chen and Feng, 2007Program: not specified
CapillaryMethyl Silicone765.Feng and Mu, 2007Program: not specified
CapillaryHP-5MS775.Mallia, Escher, et al., 2007Program: not specified
CapillaryDB-1754.Cramer, Mattinson, et al., 200560. m/0.32 mm/0.25 μm, He; Program: 33C(5min) => 2C/min => 50c => 5C/min => 225C
CapillaryHP-1764.Junkes, Amboni, et al., 2004Program: not specified
CapillaryHP-5795.Sotomayor, Martínez, et al., 200430. m/0.25 mm/0.25 μm, He; Program: 60C(4min) => 1C/min => 64C => 2.5C/min => 155C => 5C/min => 250C
CapillarySE-30767.Vinogradov, 2004Program: not specified
CapillarySPB-5782.Begnaud, Pérès, et al., 200360. m/0.32 mm/1. μm; Program: not specified
CapillaryPolydimethyl siloxane764.Junkes, Castanho, et al., 2003Program: not specified
CapillaryHP-5787.Jordán, Goodner, et al., 200230. m/0.25 mm/0.25 μm; Program: not specified
CapillaryCP Sil 8 CB779.Duckham, Dodson, et al., 200160. m/0.25 mm/0.25 μm; Program: not specified
CapillaryMethyl Silicone765.Estrada and Gutierrez, 1999Program: not specified
CapillarySPB-1768.Flanagan, Streete, et al., 199760. m/0.53 mm/5. μm, He; Program: 40C(6min) => 5C/min => 80C => 10C/min => 200C
CapillarySPB-1768.Strete, Ruprah, et al., 199260. m/0.53 mm/5.0 μm, Helium; Program: 40 0C (6 min) 5 0C/min -> 80 0C 10 0C/min -> 200 0C
CapillarySPB-1781.Strete, Ruprah, et al., 199260. m/0.53 mm/5.0 μm, Helium; Program: not specified
CapillaryOV-1, SE-30, Methyl silicone, SP-2100, OV-101, DB-1, etc.761.Waggott and Davies, 1984Hydrogen; Column length: 50. m; Column diameter: 0.32 mm; Program: not specified
CapillaryOV-1781.Ramsey and Flanagan, 1982Program: not specified

Normal alkane RI, polar column, custom temperature program

View large format table.

Column type Active phase I Reference Comment
CapillaryInnowax FSC1058.Bardakci, Demirci, et al., 201260. m/0.25 mm/0.25 μm, Helium; Program: 60 0C (10 min) 4 0C/min -> 220 0C 1 0C/min -> 240 0C
CapillarySOLGel-Wax1055.Johanningsmeier and McFeeters, 201130. m/0.25 mm/0.25 μm, Helium; Program: 40 0C (2 min) 5 0C/min -> 140 0C 10 0C/min -> 250 0C (3 min)
CapillarySOLGel-Wax1052.Johanningsmeier and McFeeters, 201130. m/0.25 mm/0.25 μm, Helium; Program: not specified
CapillaryHP-Innowax1049.Narain, Galvao, et al., 200730. m/0.25 mm/0.25 μm, Helium; Program: 30 0C (5 min) 5 0C/min -> 100 0C (5 min) 1 0C/min -> 130 0C 10 0C/min -> 195 0C (45 min)
CapillaryHP-Innowax1072.Narain, Galvao, et al., 2007, 230. m/0.25 mm/0.25 μm, He; Program: 30C(5min) => 7C/min => 100C(5min) => 1C/min => 130C => 10C/min => 195C(45min)
CapillaryHP-Innowax1075.Narain, Galvao, et al., 2007, 230. m/0.25 mm/0.25 μm, He; Program: 30C(5min) => 7C/min => 100C(5min) => 1C/min => 130C => 10C/min => 195C(45min)
CapillaryInnowax1068.Junkes, Amboni, et al., 2004Program: not specified
CapillaryCarbowax 20M1055.Vinogradov, 2004Program: not specified
CapillaryCarbowax 20M1052.Saura, LAencina, et al., 2003Helium; Column length: 50. m; Column diameter: 0.70 mm; Program: not specified
CapillaryDB-Wax1042.Caldentey, Daria Fumi, et al., 199830. m/0.25 mm/0.25 μm, He; Program: 25C(8min) => 4C/min => 60C => 6C/min => 160C => 20C/min => 200C
CapillaryDB-Wax1048.Peng, Yang, et al., 1991Program: not specified
CapillaryCarbowax 20M1055.Ramsey and Flanagan, 1982Program: not specified

References

Harrop, Head, et al., 1970
Harrop, D.; Head, A.J.; Lewis, G.B.,
Thermodynamic properties of organic oxygen compounds. 22. Enthalpies of combustion of some aliphatic ketones,
J. Chem. Thermodyn., 1970, 2, 203-210. [all data]
Andon R.J.L., 1970
Andon R.J.L.,
Thermodynamic properties of organic oxygen compounds. Part XXIII. Low-temperature heat capacity and entropy of C6, C7, and C9 ketones,
J. Chem. Soc. A, 1970, 833-837. [all data]
Hales J.L., 1967
Hales J.L.,
Thermodynamic properties of organic oxygen compounds. Part 18. Vapor heat capacities and heats of vaporization of ethyl ketone, ethyl propyl ketone, methyl isopropyl ketone, and methyl phenyl ether,
Trans. Faraday Soc., 1967, 63, 1876-1879. [all data]
Meot-Ner, 1984
Meot-Ner, (Mautner)M.,
The Ionic Hydrogen Bond and Ion Solvation. 1. -NH+ O-, -NH+ N- and -OH+ O- Bonds. Correlations with Proton Affinity. Deviations Due to Structural Effects,
J. Am. Chem. Soc., 1984, 106, 5, 1257, https://doi.org/10.1021/ja00317a015
. [all data]
Hunter and Lias, 1998
Hunter, E.P.; Lias, S.G.,
Evaluated Gas Phase Basicities and Proton Affinities of Molecules: An Update,
J. Phys. Chem. Ref. Data, 1998, 27, 3, 413-656, https://doi.org/10.1063/1.556018
. [all data]
Holmes, Fingas, et al., 1981
Holmes, J.L.; Fingas, M.; Lossing, F.P.,
Towards a general scheme for estimating the heats of formation of organic ions in the gas phase. Part I. Odd-electron cations,
Can. J. Chem., 1981, 59, 80. [all data]
Ashmore and Burgess, 1978
Ashmore, F.S.; Burgess, A.R.,
Photoelectron spectra of the unbranched C5-C7 alkenes, aldehydes and ketones,
J. Chem. Soc. Faraday Trans. 2, 1978, 74, 734. [all data]
Yeo and Williams, 1969
Yeo, A.N.H.; Williams, D.H.,
Internal hydrogen rearrangement as a function of ion lifetime in the mass spectra of aliphatic ketones,
J. Am. Chem. Soc., 1969, 91, 3582. [all data]
Holmes and Lossing, 1980
Holmes, J.L.; Lossing, F.P.,
Gas-phase heats of formation of keto and enol ions of carbonyl compounds.,
J. Am. Chem. Soc., 1980, 102, 1591. [all data]