Benzenamine, 4-ethyl-
- Formula: C8H11N
- Molecular weight: 121.1796
- IUPAC Standard InChIKey: HRXZRAXKKNUKRF-UHFFFAOYSA-N
- CAS Registry Number: 589-16-2
- Chemical structure:
View 3d structure (requires JavaScript / HTML 5) - Other names: Aniline, p-ethyl-; p-Ethylaniline; Aniline, 4-ethyl-; 4-Ethylaniline; para-Ethylaniline; 1-Amino-4-ethylbenzene; p-Aminoethylbenzene; 4-Aminoethylbenzene; 4-Ethylphenylamine; NSC 62015; p-Ethylaminobenzene

Phase change data

Data compiled as indicated in comments:
BS - Robert L. Brown and Stephen E. Stein
TRC - Thermodynamics Research Center, NIST Boulder Laboratories, Chris Muzny director
AC - William E. Acree, Jr., James S. Chickos
Quantity | Value | Units | Method | Reference | Comment |
---|---|---|---|---|---|
Tboil | 489. ± 4. | K | AVG | N/A | Average of 6 values; Individual data points |
Quantity | Value | Units | Method | Reference | Comment |
Tfus | 267. ± 3. | K | AVG | N/A | Average of 6 values; Individual data points |
Reduced pressure boiling point
Tboil (K) | Pressure (bar) | Reference | Comment |
---|---|---|---|
364. to 365. | 0.008 | Frinton Laboratories Inc., 1986 | BS |
Enthalpy of vaporization
ΔvapH (kJ/mol) | Temperature (K) | Method | Reference | Comment |
---|---|---|---|---|
53.1 | 408. | A | Stephenson and Malanowski, 1987 | Based on data from 393. to 491. K.; AC |
54.6 | 340. | N/A | Stull, 1947 | Based on data from 325. to 490. K.; AC |
Antoine Equation Parameters
log10(P) = A − (B / (T + C))
P = vapor pressure (bar)
T = temperature (K)
View plot Requires a JavaScript / HTML 5 canvas capable browser.
Temperature (K) | A | B | C | Reference | Comment |
---|---|---|---|---|---|
325. to 490.6 | 5.07568 | 2318.392 | -33.508 | Stull, 1947 | Coefficents calculated by NIST from author's data. |

Gas phase ion energetics data

Data compiled by: Henry M. Rosenstock, Keith Draxl, Bruce W. Steiner, and John T. Herron
Ionization energy determinations
IE (eV) | Method | Reference |
---|---|---|
7.6 ± 0.1 | CTS | Farrell and Newton, 1966 |

Kovats' RI, polar column, isothermal

View large format table.

Column type Active phase Temperature (C) I Reference Comment
PackedCarbowax 20M200.1947.Vernon and Suratman, 1983He, Silanized white support; Column length: 2. m
PackedCarbowax 20M165.1893.7Ellis and Still, 1979Chromosorb W, AW-DMCS
PackedPEG-20M210.1919.9Still, Evans, et al., 1972Chromosorb G; Column length: 3. m

References

Frinton Laboratories Inc., 1986
Frinton Laboratories Inc.,
Catalog Number 11, Frinton Laboratories Inc., Vineland, NJ, 1986, 99. [all data]
Stephenson and Malanowski, 1987
Stephenson, Richard M.; Malanowski, Stanislaw,
Handbook of the Thermodynamics of Organic Compounds, 1987, https://doi.org/10.1007/978-94-009-3173-2
. [all data]
Stull, 1947
Stull, Daniel R.,
Vapor Pressure of Pure Substances. Organic and Inorganic Compounds,
Ind. Eng. Chem., 1947, 39, 4, 517-540, https://doi.org/10.1021/ie50448a022
. [all data]
Farrell and Newton, 1966
Farrell, P.G.; Newton, J.,
Ionization potentials of primary aromatic amines and aza-hydrocarbons,
Tetrahedron Lett., 1966, 5517. [all data]