Benzene, (2-bromoethoxy)-
- Formula: C8H9BrO
- Molecular weight: 201.060
- IUPAC Standard InChIKey: JJFOBACUIRKUPN-UHFFFAOYSA-N
- CAS Registry Number: 589-10-6
- Chemical structure:

Phase change data

Data compiled by: Robert L. Brown and Stephen E. Stein
Reduced pressure boiling point
Tboil (K) | Pressure (bar) | Reference |
---|---|---|
417.2 | 0.053 | Aldrich Chemical Company Inc., 1990 |

Gas phase ion energetics data

Data compiled by: Sharon G. Lias, Rhoda D. Levin, and Sherif A. Kafafi
Ionization energy determinations
IE (eV) | Method | Reference |
---|---|---|
8.42 | EI | Russell, Gross, et al., 1979 |
8.49 ± 0.05 | EI | Schwarz, Petersen, et al., 1977 |
Appearance energy determinations
Ion | AE (eV) | Other Products | Method | Reference | Comment |
---|---|---|---|---|---|
C6H6O+ | 9.71 | C2H3Br | EI | Russell, Gross, et al., 1979 |

References

Aldrich Chemical Company Inc., 1990
Aldrich Chemical Company Inc.,
Catalog Handbook of Fine Chemicals, Aldrich Chemical Company, Inc., Milwaukee WI, 1990, 1. [all data]
Russell, Gross, et al., 1979
Russell, D.H.; Gross, M.L.; Van der Greef, J.; Nibbering, N.M.M.,
The chemistry of C6H6O radical cations: A study of rearrangement reactions of halogen substituted ethyl phenyl ethers,
Org. Mass Spectrom., 1979, 14, 474. [all data]
Schwarz, Petersen, et al., 1977
Schwarz, H.; Petersen, R.D.; Van De Sande, C.C.,
Entropische und energetische Effekte bei der Bildung cyclischer Oxonium-, Sulfonium- und Bromonium-Ionen aus ωsubstituierten Phenoxyalkanen,
Org. Mass Spectrom., 1977, 12, 391. [all data]