3-Methoxyacetanilide
- Formula: C9H11NO2
- Molecular weight: 165.1891
- IUPAC Standard InChIKey: OIEFZHJNURGFFI-UHFFFAOYSA-N
- CAS Registry Number: 588-16-9
- Chemical structure:
View 3d structure (requires JavaScript / HTML 5) - Other names: Acetamide, N-(3-methoxyphenyl)-; m-Acetanisidide; m-Acetanisidine; m-Methoxyacetanilide; Acetanilide, 3'-methoxy-; Aceto-m-anisidide; N-Acetyl-m-anisidine; 3'-Methoxyacetanilide; N-(3-Methoxyphenyl)acetic acid amide

Gas phase ion energetics data

Data compiled by: Henry M. Rosenstock, Keith Draxl, Bruce W. Steiner, and John T. Herron
Ionization energy determinations
IE (eV) | Method | Reference |
---|---|---|
8.0 ± 0.2 | EI | Gamble, Gilbert, et al., 1970 |
Appearance energy determinations
Ion | AE (eV) | Other Products | Method | Reference | Comment |
---|---|---|---|---|---|
C7H9NO+ | 10.7 ± 0.2 | ? | EI | Gamble, Gilbert, et al., 1970 |

References

Gamble, Gilbert, et al., 1970
Gamble, A.A.; Gilbert, J.R.; Tillett, J.G.,
Substituent effects in the fragmentation of acetanilides,,
J. Chem. Soc. B, 1970, 1231. [all data]