2-Furancarbonyl bromide
- Formula: C5H3BrO2
- Molecular weight: 174.980
- IUPAC Standard InChIKey: HBIBWEWPHYPOCX-UHFFFAOYSA-N
- CAS Registry Number: 58777-49-4
- Chemical structure:
View 3d structure (requires JavaScript / HTML 5) - Permanent link for this species. Use this link for bookmarking this species for future reference.

Gas phase ion energetics data

Data compiled by: Sharon G. Lias and Joel F. Liebman
Ionization energy determinations
IE (eV) | Method | Reference | Comment |
---|---|---|---|
9.42 | PE | Klapstein, MacPherson, et al., 1990 | |
9.56 | PE | Klapstein, MacPherson, et al., 1990 | Vertical value |

References

Klapstein, MacPherson, et al., 1990
Klapstein, D.; MacPherson, C.D.; O'Brien, R.T.,
The photoelectron spectra and electronic structure of 2-carbonyl furans,
Can. J. Chem., 1990, 68, 747. [all data]