Benzene, nitroso-
- Formula: C6H5NO
- Molecular weight: 107.1100
- IUPAC Standard InChIKey: NLRKCXQQSUWLCH-UHFFFAOYSA-N
- CAS Registry Number: 586-96-9
- Chemical structure:
View 3d structure (requires JavaScript / HTML 5) - Other names: Nitrosobenzene

Gas phase thermochemistry data

Data compiled by: Hussein Y. Afeefy, Joel F. Liebman, and Stephen E. Stein
Quantity | Value | Units | Method | Reference | Comment |
---|---|---|---|---|---|
ΔfH°gas | 201. ± 4.2 | kJ/mol | Kin | Choo, Golden, et al., 1975 |

Condensed phase thermochemistry data

Data compiled by: Hussein Y. Afeefy, Joel F. Liebman, and Stephen E. Stein
Quantity | Value | Units | Method | Reference | Comment |
---|---|---|---|---|---|
ΔcH°solid | -3105. ± 6.3 | kJ/mol | Ccb | Drucker and Flade, 1930 |

Phase change data

Data compiled as indicated in comments:
TRC - Thermodynamics Research Center, NIST Boulder Laboratories, Chris Muzny director
ALS - Hussein Y. Afeefy, Joel F. Liebman, and Stephen E. Stein
AC - William E. Acree, Jr., James S. Chickos
Quantity | Value | Units | Method | Reference | Comment |
---|---|---|---|---|---|
Tfus | 339.65 | K | N/A | Bruhl, 1897 | Uncertainty assigned by TRC = 2. K; TRC |
Quantity | Value | Units | Method | Reference | Comment |
ΔsubH° | 80.8 | kJ/mol | V | Drucker and Flade, 1930 | ALS |
Enthalpy of sublimation
ΔsubH (kJ/mol) | Temperature (K) | Method | Reference | Comment |
---|---|---|---|---|
85.1 | 312. | A | Stephenson and Malanowski, 1987 | Based on data from 297. to 339. K. See also Pepekin, Lebedev, et al., 1974.; AC |

Reaction thermochemistry data

Data compiled as indicated in comments:
B - John E. Bartmess
ALS - Hussein Y. Afeefy, Joel F. Liebman, and Stephen E. Stein
Individual Reactions
By formula: Br- + C6H5NO = (Br- • C6H5NO)
Quantity | Value | Units | Method | Reference | Comment |
---|---|---|---|---|---|
ΔrH° | 57.3 ± 7.5 | kJ/mol | IMRE | Paul and Kebarle, 1991 | gas phase; ΔGaff measured at 303 K, corrected to 423 K, ΔSaff taken as that of PhNO2..Br-; B |
Quantity | Value | Units | Method | Reference | Comment |
ΔrG° | 22. ± 4.2 | kJ/mol | IMRE | Paul and Kebarle, 1991 | gas phase; ΔGaff measured at 303 K, corrected to 423 K, ΔSaff taken as that of PhNO2..Br-; B |
By formula: C12H10N2O2 = 2C6H5NO
Quantity | Value | Units | Method | Reference | Comment |
---|---|---|---|---|---|
ΔrH° | 42.5 ± 1.2 | kJ/mol | Eqk | Orrell, Stephenson, et al., 1989 | liquid phase; solvent: CDCl3; NMR; ALS |
ΔrH° | 42.5 ± 1.2 | kJ/mol | Eqk | Orrell, Sik, et al., 1987 | liquid phase; solvent: CDCl3; NMR; ALS |
By formula: C12H10N2O2 = 2C6H5NO
Quantity | Value | Units | Method | Reference | Comment |
---|---|---|---|---|---|
ΔrH° | 55.4 ± 1.7 | kJ/mol | Eqk | Orrell, Stephenson, et al., 1989 | liquid phase; solvent: CDCl3; NMR; ALS |
ΔrH° | 55.4 ± 1.7 | kJ/mol | Eqk | Orrell, Sik, et al., 1987 | liquid phase; solvent: CDCl3; NMR; ALS |

Gas phase ion energetics data

Data evaluated as indicated in comments:
HL - Edward P. Hunter and Sharon G. Lias
Data compiled as indicated in comments:
LLK - Sharon G. Lias, Rhoda D. Levin, and Sherif A. Kafafi
RDSH - Henry M. Rosenstock, Keith Draxl, Bruce W. Steiner, and John T. Herron
Quantity | Value | Units | Method | Reference | Comment |
---|---|---|---|---|---|
Proton affinity (review) | 854.3 | kJ/mol | N/A | Hunter and Lias, 1998 | HL |
Quantity | Value | Units | Method | Reference | Comment |
Gas basicity | 823.6 | kJ/mol | N/A | Hunter and Lias, 1998 | HL |
Ionization energy determinations
IE (eV) | Method | Reference | Comment |
---|---|---|---|
8.0 | PE | Egdell, Green, et al., 1975 | LLK |
8.09 | PE | Rabalais and Colton, 1973 | LLK |
8.9 | PE | Rao, 1975 | Vertical value; LLK |
8.9 ± 0.1 | PE | Egdell, Green, et al., 1975, 2 | Vertical value; LLK |
8.87 | PE | Baker, May, et al., 1968 | Vertical value; RDSH |
Appearance energy determinations
Ion | AE (eV) | Other Products | Method | Reference | Comment |
---|---|---|---|---|---|
C6H5+ | 11.0 ± 0.1 | ? | EI | Carmichael, Gowenlock, et al., 1972 | LLK |

Ion clustering data

Data compiled by: John E. Bartmess
Clustering reactions
By formula: Br- + C6H5NO = (Br- • C6H5NO)
Quantity | Value | Units | Method | Reference | Comment |
---|---|---|---|---|---|
ΔrH° | 57.3 ± 7.5 | kJ/mol | IMRE | Paul and Kebarle, 1991 | gas phase; ΔGaff measured at 303 K, corrected to 423 K, ΔSaff taken as that of PhNO2..Br- |
Quantity | Value | Units | Method | Reference | Comment |
ΔrG° | 22. ± 4.2 | kJ/mol | IMRE | Paul and Kebarle, 1991 | gas phase; ΔGaff measured at 303 K, corrected to 423 K, ΔSaff taken as that of PhNO2..Br- |

References

Choo, Golden, et al., 1975
Choo, K.Y.; Golden, D.M.; Benson, S.W.,
Very-low-pressure pyrolysis of nitroso- and pentafluoronitrosobenzene C-NO bond dissociation energies,
Int. J. Chem. Kinet., 1975, 7, 713-724. [all data]
Drucker and Flade, 1930
Drucker, C.; Flade, Th.,
Das Molargewicht des nitrosobenzols in fester losung,
Z. Phys. Chem. (Leipzig), 1930, 29, 29-42. [all data]
Bruhl, 1897
Bruhl, J.W.,
Spectrochemistry of nitrogen containing compounds V,
Z. Phys. Chem., Stoechiom. Verwandtschaftsl., 1897, 22, 373. [all data]
Stephenson and Malanowski, 1987
Stephenson, Richard M.; Malanowski, Stanislaw,
Handbook of the Thermodynamics of Organic Compounds, 1987, https://doi.org/10.1007/978-94-009-3173-2
. [all data]
Pepekin, Lebedev, et al., 1974
Pepekin, V.I.; Lebedev, V.P.; Balepin, A.A.; Lebedev, Y.A.,
Dokl. Akad. Nauk SSSR, 1974, 221, 1118. [all data]
Paul and Kebarle, 1991
Paul, G.J.C.; Kebarle, P.,
Stabilities of Complexes of Br- with Substituted Benzenes (SB) Based on Determinations of the Gas-Phase Equilibria Br- + SB = (BrSB)-,
J. Am. Chem. Soc., 1991, 113, 4, 1148, https://doi.org/10.1021/ja00004a014
. [all data]
Orrell, Stephenson, et al., 1989
Orrell, K.G.; Stephenson, D.; Rault, T.,
NMR study of the monomer-dimer equilibria of dimethylnitrosobenzenes in solution. Identification of mixed azodioxy dimeric species,
Magn. Reson. Chem., 1989, 27, 368-376. [all data]
Orrell, Sik, et al., 1987
Orrell, K.G.; Sik, V.; Stephenson, D.,
Study of the monomer-dimer equilibrium of nitrosobenzene using multinuclear one- and two-dimensional NMR techniques,
Magn. Reson. Chem., 1987, 25, 1007-1011. [all data]
Hunter and Lias, 1998
Hunter, E.P.; Lias, S.G.,
Evaluated Gas Phase Basicities and Proton Affinities of Molecules: An Update,
J. Phys. Chem. Ref. Data, 1998, 27, 3, 413-656, https://doi.org/10.1063/1.556018
. [all data]
Egdell, Green, et al., 1975
Egdell, R.; Green, J.C.; Rao, C.N.R.,
Photoelectron spectra of substituted benzenes,
Chem. Phys. Lett., 1975, 33, 600. [all data]
Rabalais and Colton, 1973
Rabalais, J.W.; Colton, R.J.,
Electronic interaction between the phenyl group and its unsaturated substituents,
J. Electron Spectrosc. Relat. Phenom., 1973, 1, 83. [all data]
Rao, 1975
Rao, C.N.R.,
Lone-pair ionization bands of chromophores in the photoelectron spectra of organic molecules,
Indian J. Chem., 1975, 13, 950. [all data]
Egdell, Green, et al., 1975, 2
Egdell, R.; Green, J.C.; Rao, C.N.R.; Gowenlock, B.G.; Pfab, J.,
He(I) photoelectron studies of C-nitroso compounds,
J. Chem. Soc. Faraday Trans. 2, 1975, 988. [all data]
Baker, May, et al., 1968
Baker, A.D.; May, D.P.; Turner, D.W.,
Molecular photoelectron spectroscopy. Part VII. The vertical ionisation potentials of benzene and some of its monosubstituted and 1,4-disubstituted derivatives,
J. Chem. Soc. B, 1968, 22. [all data]
Carmichael, Gowenlock, et al., 1972
Carmichael, P.J.; Gowenlock, B.G.; Johnson, C.A.F.,
Carbon-nitrogen bond dissociation energy values in C-nitrosocompounds,
Int. J. Chem. Kinet., 1972, 4, 339. [all data]
Ramart-Lucas, Martynoff, et al., 1949
Ramart-Lucas, P.; Martynoff, M.M.; Grumez, M.; Chauvin, M.,
Sur la natrue de l'isomerie des nitrosophenols d'apres leurs spectres d'absorption (Quatrieme Memoire: Derives acyles),
Bull. Soc. Chim. Fr., 1949, 16, 905-917. [all data]