Benzoic acid, 4-bromo-
- Formula: C7H5BrO2
- Molecular weight: 201.017
- IUPAC Standard InChIKey: TUXYZHVUPGXXQG-UHFFFAOYSA-N
- CAS Registry Number: 586-76-5
- Chemical structure:
View 3d structure (requires JavaScript / HTML 5) - Other names: Benzoic acid, p-bromo-; p-Bromobenzoic acid; 4-Bromobenzoic acid; p-Carboxybromobenzene

Gas phase thermochemistry data

Data compiled by: Hussein Y. Afeefy, Joel F. Liebman, and Stephen E. Stein
Quantity | Value | Units | Method | Reference | Comment |
---|---|---|---|---|---|
ΔfH°gas | -275.9 ± 1.4 | kJ/mol | Ccr | Sabbah and Rojas Aguilar, 1996 | |
ΔfH°gas | -272.0 ± 1.7 | kJ/mol | Ccr | Ferrao and Pilcher, 1987 | |
ΔfH°gas | -290. ± 4.6 | kJ/mol | Ccb | Bjellerup, 1959 | Heat of formation derived by Cox and Pilcher, 1970 |

Condensed phase thermochemistry data

Data compiled as indicated in comments:
ALS - Hussein Y. Afeefy, Joel F. Liebman, and Stephen E. Stein
DH - Eugene S. Domalski and Elizabeth D. Hearing
Quantity | Value | Units | Method | Reference | Comment |
---|---|---|---|---|---|
ΔfH°solid | -379.0 ± 1.3 | kJ/mol | Ccr | Sabbah and Rojas Aguilar, 1996 | ALS |
ΔfH°solid | -377.4 ± 1.6 | kJ/mol | Ccb | Zhang, Xu, et al., 1990 | ALS |
ΔfH°solid | -379.6 ± 1.3 | kJ/mol | Ccr | Ferrao and Pilcher, 1987 | ALS |
ΔfH°solid | -378. ± 2. | kJ/mol | Ccb | Bjellerup, 1959 | Heat of formation derived by Cox and Pilcher, 1970; ALS |
Quantity | Value | Units | Method | Reference | Comment |
ΔcH°solid | -3090.1 ± 1.3 | kJ/mol | Ccr | Sabbah and Rojas Aguilar, 1996 | ALS |
ΔcH°solid | -3091.8 ± 1.3 | kJ/mol | Ccb | Zhang, Xu, et al., 1990 | ALS |
ΔcH°solid | -3089.5 ± 0.9 | kJ/mol | Ccr | Ferrao and Pilcher, 1987 | ALS |
ΔcH°solid | -3090.8 ± 2.1 | kJ/mol | Ccr | Bjellerup, 1959 | Reanalyzed by Cox and Pilcher, 1970, Original value = -3089.8 kJ/mol; ALS |
Constant pressure heat capacity of solid
Cp,solid (J/mol*K) | Temperature (K) | Reference | Comment |
---|---|---|---|
151.4 | 298.15 | Ferrao and Pilcher, 1987 | Value given as Cp = 0.753 J K-1 g-1.; DH |

Phase change data

Data compiled as indicated in comments:
TRC - Thermodynamics Research Center, NIST Boulder Laboratories, Chris Muzny director
AC - William E. Acree, Jr., James S. Chickos
ALS - Hussein Y. Afeefy, Joel F. Liebman, and Stephen E. Stein
Quantity | Value | Units | Method | Reference | Comment |
---|---|---|---|---|---|
Tfus | 531. | K | N/A | Lamneck, 1954 | Uncertainty assigned by TRC = 3. K; TRC |
Tfus | 527. | K | N/A | Lamneck, 1954 | Uncertainty assigned by TRC = 4. K; TRC |
Tfus | 529. | K | N/A | Lamneck, 1954 | Uncertainty assigned by TRC = 4. K; TRC |
Quantity | Value | Units | Method | Reference | Comment |
ΔsubH° | 103.1 ± 0.6 | kJ/mol | C | Tan and Raphael, 1994 | AC |
ΔsubH° | 107.6 ± 1.1 | kJ/mol | C | Ferrao and Pilcher, 1987 | ALS |
ΔsubH° | 107.6 ± 1.1 | kJ/mol | C | Ferrao and Pilcher, 1987 | AC |
ΔsubH° | 87.9 ± 4.2 | kJ/mol | V | Bjellerup, 1959 | Heat of formation derived by Cox and Pilcher, 1970; ALS |
Enthalpy of sublimation
ΔsubH (kJ/mol) | Temperature (K) | Method | Reference | Comment |
---|---|---|---|---|
107.4 ± 0.5 | 358. | ME | Ribeiro da Silva, Fonseca, et al., 2005 | Based on data from 349. to 366. K.; AC |
110.1 ± 0.8 | 358. | ME | Ribeiro da Silva, Fonseca, et al., 2005 | Based on data from 349. to 366. K.; AC |
Enthalpy of fusion
ΔfusH (kJ/mol) | Temperature (K) | Method | Reference | Comment |
---|---|---|---|---|
30.87 | 526.3 | DSC | Ribeiro da Silva, Fonseca, et al., 2005 | AC |

Gas phase ion energetics data

Data compiled as indicated in comments:
LLK - Sharon G. Lias, Rhoda D. Levin, and Sherif A. Kafafi
Ionization energy determinations
IE (eV) | Method | Reference | Comment |
---|---|---|---|
9.7 ± 0.2 | EI | Benoit, 1973 | LLK |
Appearance energy determinations
Ion | AE (eV) | Other Products | Method | Reference | Comment |
---|---|---|---|---|---|
C6H4Br+ | 15.1 ± 0.2 | CO+OH | EI | Benoit, 1973 | LLK |
C7H4OBr+ | 12.3 ± 0.2 | OH | EI | Benoit, 1973 | LLK |

Van Den Dool and Kratz RI, non-polar column, temperature ramp

Column type | Active phase | I | Reference | Comment |
---|---|---|---|---|
Packed | SE-30 | 1415. | Peng, Ding, et al., 1988 | He, Supelcoport and Chromosorb, 40. C @ 4. min, 10. K/min, 250. C @ 60. min; Column length: 3.05 m |

References

Sabbah and Rojas Aguilar, 1996
Sabbah, R.; Rojas Aguilar, A.,
Thermodynamic study of the three isomers of bromo and iodobenzoic acids. Part II,
Struct. Chem., 1996, 7, 383-390. [all data]
Ferrao and Pilcher, 1987
Ferrao, M.C.C.H.; Pilcher, G.,
Enthalpies of combustion of the three bromobenzoic acids by rotating-bomb calorimetry,
J. Chem. Thermodyn., 1987, 19, 543-548. [all data]
Bjellerup, 1959
Bjellerup, L.,
A moving-bomb method for combustion calorimetry of organic bromine compounds,
Acta Chem. Scand., 1959, 13, 1511-1541. [all data]
Cox and Pilcher, 1970
Cox, J.D.; Pilcher, G.,
Thermochemistry of Organic and Organometallic Compounds, Academic Press, New York, 1970, 1-636. [all data]
Zhang, Xu, et al., 1990
Zhang, F.M.; Xu, G.D.; Qu, S.S.,
Studies on thermochemistry of porphyrins V. The standard energies of combustion and standard enthalpies of formation of bromoporphyrin compounds,
Acta Chimica Sinica, 1990, 48, 38-41. [all data]
Lamneck, 1954
Lamneck, J.H.,
Bromination of the two propylbenzenes and three butylbenzenes,
J. Am. Chem. Soc., 1954, 76, 1106. [all data]
Tan and Raphael, 1994
Tan, Z.-C.; Raphael, S.,
Thermodynamic study of the three isomers of bromobenzoic acid,
Sci. China, Ser. B: Chem., Life Sci., Earth Sci., 1994, 37, 6, 641. [all data]
Ribeiro da Silva, Fonseca, et al., 2005
Ribeiro da Silva, Manuel A.V.; Fonseca, José M.S.; Carvalho, Rui P.B.M.; Monte, Manuel J.S.,
Thermodynamic study of the sublimation of six halobenzoic acids,
The Journal of Chemical Thermodynamics, 2005, 37, 3, 271-279, https://doi.org/10.1016/j.jct.2004.09.005
. [all data]
Benoit, 1973
Benoit, F.,
Substituent effects in mass spectrometry. III. Substituent effects in the dissociation of the molecular ions of para and meta subtituted benzoic acids,
Org. Mass Spectrom., 1973, 7, 295. [all data]
Lang (editor), 1968
Lang (editor), L.,
Absorption Spectra in the Ultraviolet and Visible Region, 1968, 10, 87. [all data]
Peng, Ding, et al., 1988
Peng, C.T.; Ding, S.F.; Hua, R.L.; Yang, Z.C.,
Prediction of Retention Indexes I. Structure-Retention Index Relationship on Apolar Columns,
J. Chromatogr., 1988, 436, 137-172, https://doi.org/10.1016/S0021-9673(00)94575-8
. [all data]