1H-1,2,4-Triazol-5-amine, 1-propyl-
- Formula: C5H10N4
- Molecular weight: 126.1597
- IUPAC Standard InChIKey: XTAFIEABFBNBSS-UHFFFAOYSA-N
- CAS Registry Number: 58661-96-4
- Chemical structure:
View 3d structure (requires JavaScript / HTML 5) - Other names: 1H-1,2,4-Triazole-5-amine,1-propyl-

Gas phase ion energetics data

Data compiled by: Sharon G. Lias, Rhoda D. Levin, and Sherif A. Kafafi
Appearance energy determinations
Ion | AE (eV) | Other Products | Method | Reference | Comment |
---|---|---|---|---|---|
C2H4N4+ | 9.9 | C3H6 | EI | Maquestiau, Van Haverbeke, et al., 1975 | |
C5H10N4+ | 8.3 | ? | EI | Maquestiau, Van Haverbeke, et al., 1975 |

References

Maquestiau, Van Haverbeke, et al., 1975
Maquestiau, A.; Van Haverbeke, Y.; Flammang, R.; Cooks, R.G.,
Fragmentation d'azoles sous l'impact electronique,
Org. Mass Spectrom., 1975, 10, 946. [all data]