Benzoic acid, 3-methoxy-
- Formula: C8H8O3
- Molecular weight: 152.1473
- IUPAC Standard InChIKey: XHQZJYCNDZAGLW-UHFFFAOYSA-N
- CAS Registry Number: 586-38-9
- Chemical structure:
View 3d structure (requires JavaScript / HTML 5) - Other names: m-Anisic acid; m-Methoxybenzoic acid; 3-Methoxybenzoic acid

Gas phase thermochemistry data

Data compiled by: Hussein Y. Afeefy, Joel F. Liebman, and Stephen E. Stein
Quantity | Value | Units | Method | Reference | Comment |
---|---|---|---|---|---|
ΔfH°gas | -446.10 ± 0.80 | kJ/mol | Ccb | Colomina, Jimenez, et al., 1978 | Reanalyzed by Pedley, Naylor, et al., 1986, Original value = -446.0 ± 1.3 kJ/mol |

Condensed phase thermochemistry data

Data compiled by: Hussein Y. Afeefy, Joel F. Liebman, and Stephen E. Stein
Quantity | Value | Units | Method | Reference | Comment |
---|---|---|---|---|---|
ΔfH°solid | -553.5 ± 1.2 | kJ/mol | Ccb | Colomina, Jimenez, et al., 1978 | |
Quantity | Value | Units | Method | Reference | Comment |
ΔcH°solid | -3737.91 ± 0.60 | kJ/mol | Ccb | Colomina, Jimenez, et al., 1978 | Corresponding ΔfHºsolid = -553.49 kJ/mol (simple calculation by NIST; no Washburn corrections) |

Phase change data

Data compiled as indicated in comments:
BS - Robert L. Brown and Stephen E. Stein
AC - William E. Acree, Jr., James S. Chickos
DRB - Donald R. Burgess, Jr.
ALS - Hussein Y. Afeefy, Joel F. Liebman, and Stephen E. Stein
Quantity | Value | Units | Method | Reference | Comment |
---|---|---|---|---|---|
ΔvapH° | 95. | kJ/mol | Sub-Fus | Perlovich, Volkova, et al., 2008 | AC |
Quantity | Value | Units | Method | Reference | Comment |
ΔsubH° | 114.7 ± 0.8 | kJ/mol | GS | Perlovich, Volkova, et al., 2008 | Based on data from 310. to 349. K.; AC |
ΔsubH° | 107.5 ± 0.4 | kJ/mol | ME | Stephenson and Malanowski, 1987 | See also Colomina, Jimenez, et al., 1978.; AC |
ΔsubH° | 107.4 | kJ/mol | N/A | Colomina, Jimenez, et al., 1978 | DRB |
Reduced pressure boiling point
Tboil (K) | Pressure (bar) | Reference | Comment |
---|---|---|---|
444.2 | 0.013 | Weast and Grasselli, 1989 | BS |
Enthalpy of sublimation
ΔsubH (kJ/mol) | Temperature (K) | Method | Reference | Comment |
---|---|---|---|---|
107.40 ± 0.40 | 318.12 | V | Colomina, Jimenez, et al., 1978 | Reanalyzed by Pedley, Naylor, et al., 1986, Original value = 107.5 ± 0.4 kJ/mol; ALS |
Enthalpy of fusion
ΔfusH (kJ/mol) | Temperature (K) | Method | Reference | Comment |
---|---|---|---|---|
24.9 | 378.7 | DSC | Perlovich, Volkova, et al., 2008 | AC |

Reaction thermochemistry data

Data compiled by: John E. Bartmess
Individual Reactions
C8H7O3- + =
By formula: C8H7O3- + H+ = C8H8O3
Quantity | Value | Units | Method | Reference | Comment |
---|---|---|---|---|---|
ΔrH° | 1420. ± 8.8 | kJ/mol | G+TS | Kebarle and McMahon, 1977 | gas phase |
Quantity | Value | Units | Method | Reference | Comment |
ΔrG° | 1391. ± 8.4 | kJ/mol | IMRE | Kebarle and McMahon, 1977 | gas phase |

Gas phase ion energetics data

Data compiled as indicated in comments:
B - John E. Bartmess
LLK - Sharon G. Lias, Rhoda D. Levin, and Sherif A. Kafafi
Ionization energy determinations
IE (eV) | Method | Reference | Comment |
---|---|---|---|
9.1 ± 0.2 | EI | Benoit, 1973 | LLK |
Appearance energy determinations
Ion | AE (eV) | Other Products | Method | Reference | Comment |
---|---|---|---|---|---|
C7H7O+ | 13.1 ± 0.2 | COOH | EI | Benoit, 1973 | LLK |
C8H7O2+ | 12.5 ± 0.2 | OH | EI | Benoit, 1973 | LLK |
De-protonation reactions
C8H7O3- + =
By formula: C8H7O3- + H+ = C8H8O3
Quantity | Value | Units | Method | Reference | Comment |
---|---|---|---|---|---|
ΔrH° | 1420. ± 8.8 | kJ/mol | G+TS | Kebarle and McMahon, 1977 | gas phase; B |
Quantity | Value | Units | Method | Reference | Comment |
ΔrG° | 1391. ± 8.4 | kJ/mol | IMRE | Kebarle and McMahon, 1977 | gas phase; B |

References

Colomina, Jimenez, et al., 1978
Colomina, M.; Jimenez, P.; Roux, M.V.; Turrion, C.,
Thermochemical properties of benzoic acid derivatives VII. Enthalpies of combustion and formation of the o-, m-, and p-methoxy-benzoic acids,
J. Chem. Thermodyn., 1978, 10, 661-665. [all data]
Pedley, Naylor, et al., 1986
Pedley, J.B.; Naylor, R.D.; Kirby, S.P.,
Thermochemical Data of Organic Compounds, Chapman and Hall, New York, 1986, 1-792. [all data]
Perlovich, Volkova, et al., 2008
Perlovich, German L.; Volkova, Tatyana V.; Manin, Alex N.; Bauer-Brandl, Annette,
Extent and mechanism of solvation and partitioning of isomers of substituted benzoic acids: A thermodynamic study in the solid state and in solution,
J. Pharm. Sci., 2008, 97, 9, 3883-3896, https://doi.org/10.1002/jps.21260
. [all data]
Stephenson and Malanowski, 1987
Stephenson, Richard M.; Malanowski, Stanislaw,
Handbook of the Thermodynamics of Organic Compounds, 1987, https://doi.org/10.1007/978-94-009-3173-2
. [all data]
Weast and Grasselli, 1989
CRC Handbook of Data on Organic Compounds, 2nd Editon, Weast,R.C and Grasselli, J.G., ed(s)., CRC Press, Inc., Boca Raton, FL, 1989, 1. [all data]
Kebarle and McMahon, 1977
Kebarle, P.; McMahon, T.B.,
Intrinsic Acidities of Substituted Phenols and Benzoic Acids Determined by Gas Phase Proton Transfer Equilibria,
J. Am. Chem. Soc., 1977, 99, 7, 2222, https://doi.org/10.1021/ja00449a032
. [all data]
Benoit, 1973
Benoit, F.,
Substituent effects in mass spectrometry. III. Substituent effects in the dissociation of the molecular ions of para and meta subtituted benzoic acids,
Org. Mass Spectrom., 1973, 7, 295. [all data]