2-Oxazolidinone, 3-chloro-4,4-dimethyl-
- Formula: C5H8ClNO2
- Molecular weight: 149.576
- IUPAC Standard InChIKey: HUPNLWZFGMGNKB-UHFFFAOYSA-N
- CAS Registry Number: 58629-01-9
- Chemical structure:
View 3d structure (requires JavaScript / HTML 5) - Other names: 3-chloro-4,4-dimethyl-2-oxazolidinone

Gas phase ion energetics data

Data compiled by: Sharon G. Lias, Rhoda D. Levin, and Sherif A. Kafafi
Ionization energy determinations
IE (eV) | Method | Reference | Comment |
---|---|---|---|
9.68 | PE | Gerson, Worley, et al., 1978 | Vertical value |

References

Gerson, Worley, et al., 1978
Gerson, S.H.; Worley, S.D.; Bodor, N.; Kaminski, J.J.; Flechtner, T.W.,
The photoelectron spectra of some heterocyclic compounds which contain N, O, Cl, and Br,
J. Electron Spectrosc. Relat. Phenom., 1978, 13, 421. [all data]