2-Oxazolidinone,4,5-dimethyl-
- Formula: C5H9NO2
- Molecular weight: 115.1305
- IUPAC Standard InChIKey: DXRZFYKVFKAPCE-UHFFFAOYSA-N
- CAS Registry Number: 58628-98-1
- Chemical structure:
View 3d structure (requires JavaScript / HTML 5) - Permanent link for this species. Use this link for bookmarking this species for future reference.

Gas phase ion energetics data

Data compiled by: Sharon G. Lias, Rhoda D. Levin, and Sherif A. Kafafi
Ionization energy determinations
IE (eV) | Method | Reference | Comment |
---|---|---|---|
9.84 | PE | Gerson, Worley, et al., 1978 | Vertical value |

References

Gerson, Worley, et al., 1978
Gerson, S.H.; Worley, S.D.; Bodor, N.; Kaminski, J.J.; Flechtner, T.W.,
The photoelectron spectra of some heterocyclic compounds which contain N, O, Cl, and Br,
J. Electron Spectrosc. Relat. Phenom., 1978, 13, 421. [all data]