1-Butene, 2-(1,1-dimethylethyl)-3,3-dimethyl-
- Formula: C10H20
- Molecular weight: 140.2658
- IUPAC Standard InChIKey: QTOBPSTXWMUPTQ-UHFFFAOYSA-N
- CAS Registry Number: 5857-68-1
- Chemical structure:
View 3d structure (requires JavaScript / HTML 5) - Species with the same structure:

Phase change data

Data compiled by: Thermodynamics Research Center, NIST Boulder Laboratories, Chris Muzny director
Quantity | Value | Units | Method | Reference | Comment |
---|---|---|---|---|---|
Tboil | 423.45 | K | N/A | Howard, Mears, et al., 1947 | Uncertainty assigned by TRC = 0.2 K |
Quantity | Value | Units | Method | Reference | Comment |
Tfus | 210.25 | K | N/A | Howard, Mears, et al., 1947 | Uncertainty assigned by TRC = 0.2 K |

Reaction thermochemistry data

Data compiled by: Hussein Y. Afeefy, Joel F. Liebman, and Stephen E. Stein
Individual Reactions
By formula: H2 + C10H20 = C10H22
Quantity | Value | Units | Method | Reference | Comment |
---|---|---|---|---|---|
ΔrH° | -117.2 ± 0.04 | kJ/mol | Chyd | Turner, Jarrett, et al., 1973 | liquid phase; solvent: Acetic acid |

Gas phase ion energetics data

Data compiled as indicated in comments:
LLK - Sharon G. Lias, Rhoda D. Levin, and Sherif A. Kafafi
Ionization energy determinations
IE (eV) | Method | Reference | Comment |
---|---|---|---|
8.795 ± 0.008 | PE | Masclet, Grosjean, et al., 1973 | LLK |

References

Howard, Mears, et al., 1947
Howard, F.L.; Mears, T.W.; Fookson, A.; Pomerantz, P.; Brooks, D.B.,
Preparation and physical properties of several aliphatic hydrocarbons and intermediates,
J. Res. Natl. Bur. Stand. (U. S.), 1947, 38, 365. [all data]
Turner, Jarrett, et al., 1973
Turner, R.B.; Jarrett, A.D.; Goebel, P.; Mallon, B.J.,
Heats of hydrogenation. 9. Cyclic acetylenes and some miscellaneous olefins,
J. Am. Chem. Soc., 1973, 95, 790-792. [all data]
Masclet, Grosjean, et al., 1973
Masclet, P.; Grosjean, D.; Mouvier, G.,
Alkene ionization potentials. Part I. Quantitative determination of alkyl group structural effects,
J. Electron Spectrosc. Relat. Phenom., 1973, 2, 225. [all data]