Benzoic acid, 3-bromo-
- Formula: C7H5BrO2
- Molecular weight: 201.017
- IUPAC Standard InChIKey: VOIZNVUXCQLQHS-UHFFFAOYSA-N
- CAS Registry Number: 585-76-2
- Chemical structure:
View 3d structure (requires JavaScript / HTML 5) - Other names: Benzoic acid, m-bromo-; m-Bromobenzoic acid; 3-Bromobenzoic acid

Gas phase thermochemistry data

Data compiled by: Hussein Y. Afeefy, Joel F. Liebman, and Stephen E. Stein
Quantity | Value | Units | Method | Reference | Comment |
---|---|---|---|---|---|
ΔfH°gas | -268.3 ± 1.5 | kJ/mol | Ccr | Sabbah and Rojas Aguilar, 1996 | |
ΔfH°gas | -289.7 ± 1.6 | kJ/mol | Ccr | Ferrao and Pilcher, 1987 |

Condensed phase thermochemistry data

Data compiled as indicated in comments:
ALS - Hussein Y. Afeefy, Joel F. Liebman, and Stephen E. Stein
DH - Eugene S. Domalski and Elizabeth D. Hearing
Quantity | Value | Units | Method | Reference | Comment |
---|---|---|---|---|---|
ΔfH°solid | -367.5 ± 1.5 | kJ/mol | Ccr | Sabbah and Rojas Aguilar, 1996 | ALS |
ΔfH°solid | -394.7 ± 1.2 | kJ/mol | Ccr | Ferrao and Pilcher, 1987 | ALS |
Quantity | Value | Units | Method | Reference | Comment |
ΔcH°solid | -3101.6 ± 1.5 | kJ/mol | Ccr | Sabbah and Rojas Aguilar, 1996 | ALS |
ΔcH°solid | -3074.4 ± 0.8 | kJ/mol | Ccr | Ferrao and Pilcher, 1987 | ALS |
Constant pressure heat capacity of solid
Cp,solid (J/mol*K) | Temperature (K) | Reference | Comment |
---|---|---|---|
151.4 | 298.15 | Ferrao and Pilcher, 1987 | Value given as Cp = 0.753 J K-1 g-1.; DH |

Phase change data

Data compiled as indicated in comments:
BS - Robert L. Brown and Stephen E. Stein
TRC - Thermodynamics Research Center, NIST Boulder Laboratories, Chris Muzny director
AC - William E. Acree, Jr., James S. Chickos
ALS - Hussein Y. Afeefy, Joel F. Liebman, and Stephen E. Stein
Quantity | Value | Units | Method | Reference | Comment |
---|---|---|---|---|---|
Tboil | 553. | K | N/A | Buckingham and Donaghy, 1982 | BS |
Quantity | Value | Units | Method | Reference | Comment |
Tfus | 428. | K | N/A | Buckingham and Donaghy, 1982 | BS |
Tfus | 427. | K | N/A | Simons and Ramler, 1943 | Uncertainty assigned by TRC = 4. K; TRC |
Quantity | Value | Units | Method | Reference | Comment |
ΔsubH° | 105.9 ± 0.7 | kJ/mol | ME | Ribeiro da Silva, Fonseca, et al., 2005 | Based on data from 328. to 347. K.; AC |
ΔsubH° | 99.2 ± 0.2 | kJ/mol | C | Tan and Raphael, 1994 | AC |
ΔsubH° | 105.0 ± 1.1 | kJ/mol | C | Ferrao and Pilcher, 1987 | ALS |
ΔsubH° | 105.0 ± 1.1 | kJ/mol | C | Ferrao and Pilcher, 1987 | AC |
Enthalpy of sublimation
ΔsubH (kJ/mol) | Temperature (K) | Method | Reference | Comment |
---|---|---|---|---|
104.2 ± 0.5 | 338. | ME | Ribeiro da Silva, Fonseca, et al., 2005 | Based on data from 328. to 347. K.; AC |
Enthalpy of fusion
ΔfusH (kJ/mol) | Temperature (K) | Method | Reference | Comment |
---|---|---|---|---|
24.91 | 430.1 | DSC | Ribeiro da Silva, Fonseca, et al., 2005 | AC |

Gas phase ion energetics data

Data compiled by: Sharon G. Lias, Rhoda D. Levin, and Sherif A. Kafafi
Ionization energy determinations
IE (eV) | Method | Reference |
---|---|---|
9.7 ± 0.2 | EI | Benoit, 1973 |
Appearance energy determinations
Ion | AE (eV) | Other Products | Method | Reference | Comment |
---|---|---|---|---|---|
C6H4Br+ | 14.9 ± 0.2 | CO+OH | EI | Benoit, 1973 | |
C7H4OBr+ | 12.2 ± 0.2 | OH | EI | Benoit, 1973 |

Van Den Dool and Kratz RI, non-polar column, temperature ramp

Column type | Active phase | I | Reference | Comment |
---|---|---|---|---|
Packed | SE-30 | 1425. | Peng, Ding, et al., 1988 | He, Supelcoport and Chromosorb, 40. C @ 4. min, 10. K/min, 250. C @ 60. min; Column length: 3.05 m |

References

Sabbah and Rojas Aguilar, 1996
Sabbah, R.; Rojas Aguilar, A.,
Thermodynamic study of the three isomers of bromo and iodobenzoic acids. Part II,
Struct. Chem., 1996, 7, 383-390. [all data]
Ferrao and Pilcher, 1987
Ferrao, M.C.C.H.; Pilcher, G.,
Enthalpies of combustion of the three bromobenzoic acids by rotating-bomb calorimetry,
J. Chem. Thermodyn., 1987, 19, 543-548. [all data]
Buckingham and Donaghy, 1982
Buckingham, J.; Donaghy, S.M.,
Dictionary of Organic Compounds: Fifth Edition, Chapman and Hall, New York, 1982, 1. [all data]
Simons and Ramler, 1943
Simons, J.H.; Ramler, E.O.,
Preparation and Properties of SOme New Trifluoromethyl Compounds,
J. Am. Chem. Soc., 1943, 65, 389. [all data]
Ribeiro da Silva, Fonseca, et al., 2005
Ribeiro da Silva, Manuel A.V.; Fonseca, José M.S.; Carvalho, Rui P.B.M.; Monte, Manuel J.S.,
Thermodynamic study of the sublimation of six halobenzoic acids,
The Journal of Chemical Thermodynamics, 2005, 37, 3, 271-279, https://doi.org/10.1016/j.jct.2004.09.005
. [all data]
Tan and Raphael, 1994
Tan, Z.-C.; Raphael, S.,
Thermodynamic study of the three isomers of bromobenzoic acid,
Sci. China, Ser. B: Chem., Life Sci., Earth Sci., 1994, 37, 6, 641. [all data]
Benoit, 1973
Benoit, F.,
Substituent effects in mass spectrometry. III. Substituent effects in the dissociation of the molecular ions of para and meta subtituted benzoic acids,
Org. Mass Spectrom., 1973, 7, 295. [all data]
Peng, Ding, et al., 1988
Peng, C.T.; Ding, S.F.; Hua, R.L.; Yang, Z.C.,
Prediction of Retention Indexes I. Structure-Retention Index Relationship on Apolar Columns,
J. Chromatogr., 1988, 436, 137-172, https://doi.org/10.1016/S0021-9673(00)94575-8
. [all data]