Ethanone, 1-(3-methylphenyl)-
- Formula: C9H10O
- Molecular weight: 134.1751
- IUPAC Standard InChIKey: FSPSELPMWGWDRY-UHFFFAOYSA-N
- CAS Registry Number: 585-74-0
- Chemical structure:
View 3d structure (requires JavaScript / HTML 5) - Other names: Acetophenone, 3'-methyl-; m-Methylacetophenone; Acetophenone, m-methyl-; 3-Methylacetophenone; 3'-Methylacetophenone; 1-(3-Methylphenyl)ethanone

Phase change data

Data compiled by: Robert L. Brown and Stephen E. Stein
Quantity | Value | Units | Method | Reference | Comment |
---|---|---|---|---|---|
Tboil | 493.2 | K | N/A | Weast and Grasselli, 1989 |
Reduced pressure boiling point
Tboil (K) | Pressure (bar) | Reference |
---|---|---|
382.2 | 0.016 | Weast and Grasselli, 1989 |

Gas phase ion energetics data

Data evaluated as indicated in comments:
HL - Edward P. Hunter and Sharon G. Lias
Data compiled as indicated in comments:
LLK - Sharon G. Lias, Rhoda D. Levin, and Sherif A. Kafafi
RDSH - Henry M. Rosenstock, Keith Draxl, Bruce W. Steiner, and John T. Herron
Quantity | Value | Units | Method | Reference | Comment |
---|---|---|---|---|---|
Proton affinity (review) | 868.2 | kJ/mol | N/A | Hunter and Lias, 1998 | HL |
Quantity | Value | Units | Method | Reference | Comment |
Gas basicity | 836.4 | kJ/mol | N/A | Hunter and Lias, 1998 | HL |
Ionization energy determinations
IE (eV) | Method | Reference | Comment |
---|---|---|---|
9.24 ± 0.02 | EI | Rabbih, Helal, et al., 1981 | LLK |
8.85 | PE | Kobayashi and Nagakura, 1974 | LLK |
9.15 ± 0.05 | EI | Pignataro, Foffani, et al., 1966 | RDSH |
9.14 | PE | Kobayashi and Nagakura, 1974 | Vertical value; LLK |
Appearance energy determinations
Ion | AE (eV) | Other Products | Method | Reference | Comment |
---|---|---|---|---|---|
C8H7O+ | 10.1 ± 0.1 | CH3 | EI | Chin and Harrison, 1969 | RDSH |

Kovats' RI, non-polar column, isothermal

Column type | Active phase | Temperature (C) | I | Reference | Comment |
---|---|---|---|---|---|
Packed | OV-101 | 120. | 1148.3 | Righezza, Hassani, et al., 1996 | N2, Chromosorb G HP; Column length: 5. m |
Packed | OV-101 | 130. | 1149.5 | Righezza, Hassani, et al., 1996 | N2, Chromosorb G HP; Column length: 5. m |
Packed | OV-101 | 140. | 1161.7 | Righezza, Hassani, et al., 1996 | N2, Chromosorb G HP; Column length: 5. m |
Packed | OV-101 | 160. | 1168.9 | Hassani and Meklati, 1992 | N2, Chromosorb G HP; Column length: 5. m |
Packed | OV-101 | 150. | 1164.3 | Maeck, Touabet, et al., 1989 | N2, Chromosorb G HP; Column length: 2. m |

Van Den Dool and Kratz RI, non-polar column, temperature ramp

Column type | Active phase | I | Reference | Comment |
---|---|---|---|---|
Capillary | DB-5 | 1182.5 | Xu, van Stee, et al., 2003 | 30. m/0.25 mm/1. μm, He, 2.5 K/min; Tstart: 50. C; Tend: 200. C |
Capillary | SE-54 | 1191.88 | Yin, Xiu, et al., 2001 | 35. C @ 3. min, 4. K/min, 230. C @ 10. min; Column length: 25. m; Column diameter: 0.31 mm |

Normal alkane RI, non-polar column, temperature ramp

Column type | Active phase | I | Reference | Comment |
---|---|---|---|---|
Capillary | VF-5 MS | 1192. | Liu, Lu, et al., 2011 | 30. m/0.25 mm/0.25 μm, Helium, 40. C @ 3. min, 5. K/min, 250. C @ 3. min |
Capillary | HP-5 | 1171.7 | Leffingwell and Alford, 2005 | 60. m/0.32 mm/0.25 μm, He, 30. C @ 2. min, 2. K/min, 260. C @ 28. min |
Capillary | BP-1 | 1132. | Srivastava, Srivastava, et al., 2005 | 30. m/0.32 mm/0.25 μm, N2, 5. K/min, 220. C @ 15. min; Tstart: 60. C |
Capillary | OV-101 | 1156. | Tamura, Boonbumrung, et al., 2000 | Nitrogen, 40. C @ 10. min, 2. K/min; Column length: 50. m; Column diameter: 0.25 mm; Tend: 200. C |

Normal alkane RI, non-polar column, custom temperature program

Column type | Active phase | I | Reference | Comment |
---|---|---|---|---|
Capillary | TR-5 MS | 1175. | Kurashov, Mitrukova, et al., 2014 | 15. m/0.25 mm/0.25 μm, Helium; Program: 35 0C (3 min) 2 0C/min -> 60 0C (3 min) 2 0C/min -> 80 0C (3 min) 4 0C/min -> 120 0C (3 min) 5 0C/min -> 150 0C (3 min) 15 0C/min -> 240 0C (10 min) |
Capillary | VF-5 MS | 1182. | Liu, Lu, et al., 2011 | 30. m/0.25 mm/0.25 μm, Helium; Program: not specified |
Capillary | OV-101 | 1148. | Ebrahimi and Hadjmohammadi, 2006 | Program: not specified |
Capillary | DB-5 | 1176. | Andrade, Maia, et al., 2000 | 30. m/0.25 mm/0.25 μm, He; Program: 40C => 2C/min => 60C => 4C/min => 260C |
Capillary | Polydimethyl siloxanes | 1147. | Zenkevich and Chupalov, 1996 | Program: not specified |

Normal alkane RI, polar column, temperature ramp

Column type | Active phase | I | Reference | Comment |
---|---|---|---|---|
Capillary | RTX-Wax | 1804. | Galindo-Cuspinera, Lubran, et al., 2002 | 60. m/0.25 mm/0.5 μm, He, 40. C @ 5. min, 5. K/min, 180. C @ 20. min |
Capillary | DB-Wax | 1786. | Tamura, Boonbumrung, et al., 2000 | Nitrogen, 40. C @ 10. min, 2. K/min; Column length: 60. m; Column diameter: 0.25 mm; Tend: 200. C |

References

Weast and Grasselli, 1989
CRC Handbook of Data on Organic Compounds, 2nd Editon, Weast,R.C and Grasselli, J.G., ed(s)., CRC Press, Inc., Boca Raton, FL, 1989, 1. [all data]
Hunter and Lias, 1998
Hunter, E.P.; Lias, S.G.,
Evaluated Gas Phase Basicities and Proton Affinities of Molecules: An Update,
J. Phys. Chem. Ref. Data, 1998, 27, 3, 413-656, https://doi.org/10.1063/1.556018
. [all data]
Rabbih, Helal, et al., 1981
Rabbih, M.A.; Helal, A.I.; Fahmey, M.A.,
Mass spectrometric studies of methylacetophenone isomers by electron impact,
Indian J. Pure Appl. Phys., 1981, 19, 335. [all data]
Kobayashi and Nagakura, 1974
Kobayashi, T.; Nagakura, S.,
Photoelectron spectra of substituted benzenes,
Bull. Chem. Soc. Jpn., 1974, 47, 2563. [all data]
Pignataro, Foffani, et al., 1966
Pignataro, S.; Foffani, A.; Innorta, G.; Distefano, G.,
Molecular structural effects on the ionization potentials for metasubstituted aromatic compounds and for compounds of the type X-CH2-R,
Z. Physik. Chem. (Frankfurt), 1966, 49, 291. [all data]
Chin and Harrison, 1969
Chin, M.S.; Harrison, A.G.,
Substituent effects on ion abundances and energetics in substituted acetophenones,
Org. Mass Spectrom., 1969, 2, 1073. [all data]
Righezza, Hassani, et al., 1996
Righezza, M.; Hassani, A.; Meklati, B.Y.; Chrétien, J.R.,
Quantitative structure-retention relationships (QSRR) of congeneric aromatics series studied on phenyl OV phases in gas chromatography,
J. Chromatogr. A, 1996, 723, 1, 77-91, https://doi.org/10.1016/0021-9673(95)00816-0
. [all data]
Hassani and Meklati, 1992
Hassani, A.; Meklati, B.Y.,
Gas chromatographic behaviour of monosubstituted benzenes, benzaldehydes and acetophenones on OV polymethylphenyl-silicone stationary phases,
Chromatographia, 1992, 33, 5/6, 267-271, https://doi.org/10.1007/BF02276193
. [all data]
Maeck, Touabet, et al., 1989
Maeck, M.; Touabet, A.; Badjah Hadj Ahmed, A.Y.; Meklati, B.Y.,
A numerical interpolation of Kováts indices without dead time correction,
Chromatographia, 1989, 27, 5/6, 205-208, https://doi.org/10.1007/BF02260447
. [all data]
Xu, van Stee, et al., 2003
Xu, X.; van Stee, L.L.P.; Williams, J.; Beens, J.; Adahchour, M.; Vreuls, R.J.J.; Brinkman, U.A.Th.; Lelieveld, J.,
Comprehensive two-dimensional gas chromatography (GC×GC) measurements of volatile organic compounds in the atmosphere,
Atmos. Chem. Phys., 2003, 3, 3, 665-682, https://doi.org/10.5194/acp-3-665-2003
. [all data]
Yin, Xiu, et al., 2001
Yin, W.; Xiu, Z.; Aijin, H.,
Analysis of the volatile components in trogopterorum feces by capillary gas chromatography and gas chromatography/mass spectrometry,
Fenxi Huaxue, 2001, 29, 2, 195-198. [all data]
Liu, Lu, et al., 2011
Liu, S.; Lu, S.; Su, Y.; Guo, Y.,
Analysis of volatile compounds in Radix Bupleuri injection by GC-MS-MS,
Chromatographia, 2011, 74, 5-6, 497-502, https://doi.org/10.1007/s10337-011-2082-7
. [all data]
Leffingwell and Alford, 2005
Leffingwell, J.C.; Alford, E.D.,
Volatile constituents of Perique tobacco,
Electron. J. Environ. Agric. Food Chem., 2005, 4, 2, 899-915. [all data]
Srivastava, Srivastava, et al., 2005
Srivastava, A.K.; Srivastava, S.K.; Syamsundar, K.V.,
Bud and leaf essential oil composition of Syzygium aromaticum from India and Madagascar,
Flavour Fragr. J., 2005, 20, 1, 51-53, https://doi.org/10.1002/ffj.1364
. [all data]
Tamura, Boonbumrung, et al., 2000
Tamura, H.; Boonbumrung, S.; Yoshizawa, T.; Varanyanond, W.,
Volatile components of the essential oil in the pulp of four yellow mangoes (Mangifera indica L.) in Thailand,
Food Sci. Technol. Res., 2000, 6, 1, 68-73, https://doi.org/10.3136/fstr.6.68
. [all data]
Kurashov, Mitrukova, et al., 2014
Kurashov, E.A.; Mitrukova, G.G.; Krylova, Yu.V.,
Variations in the component composition of essential oil of Ceratophyllum demersum (Ceratophyllaceae) during vegetation (in press),
Plant Resources (Rastitel'nye Resursy), 2014, 1, 000-000. [all data]
Ebrahimi and Hadjmohammadi, 2006
Ebrahimi, P.; Hadjmohammadi, M.R.,
Simultaneous modeling of the Kovats retention indices on phenyl OV stationary phases with different polarity using MLR and ANN,
QSAR Comb. Sci., 2006, 25, 10, 836-845, https://doi.org/10.1002/qsar.200530145
. [all data]
Andrade, Maia, et al., 2000
Andrade, E.H.A.; Maia, J.G.S.; Zoghbi, M.G.B.,
Aroma volatile constituents of Brazilian varieties of mango fruit,
J. Food Comp. Anal., 2000, 13, 1, 27-33, https://doi.org/10.1006/jfca.1999.0841
. [all data]
Zenkevich and Chupalov, 1996
Zenkevich, I.G.; Chupalov, A.A.,
New Possibilities of Chromato Mass Pectrometric Identification of Organic Compounds Using Increments of Gas Chromatographic Retention Indices of Molecular Structural Fragments,
Zh. Org. Khim. (Rus.), 1996, 32, 5, 656-666. [all data]
Galindo-Cuspinera, Lubran, et al., 2002
Galindo-Cuspinera, V.; Lubran, M.B.; Rankin, S.A.,
Comparison of volatile compounds in water- and oil-soluble annatto (Bixa orellana L.) extracts,
J. Agric. Food Chem., 2002, 50, 7, 2010-2015, https://doi.org/10.1021/jf011325h
. [all data]