2,2,4-Trimethyl-3-pentanone
- Formula: C8H16O
- Molecular weight: 128.2120
- IUPAC Standard InChIKey: OVCHQRXVZXVQNQ-UHFFFAOYSA-N
- CAS Registry Number: 5857-36-3
- Chemical structure:
View 3d structure (requires JavaScript / HTML 5) - Other names: tert-Butyl isopropyl ketone; tert-C4H9CO(iso-C3H7); Isopropyl tert-butyl ketone; Pentamethylacetone; 3-Pentanone, 2,2,4-trimethyl-

Gas phase thermochemistry data

Data compiled by: Hussein Y. Afeefy, Joel F. Liebman, and Stephen E. Stein
Quantity | Value | Units | Method | Reference | Comment |
---|---|---|---|---|---|
ΔfH°gas | -338.3 ± 1.2 | kJ/mol | Ccr | Seller, 1970 |

Gas phase ion energetics data

Data evaluated as indicated in comments:
HL - Edward P. Hunter and Sharon G. Lias
Data compiled as indicated in comments:
LLK - Sharon G. Lias, Rhoda D. Levin, and Sherif A. Kafafi
Quantity | Value | Units | Method | Reference | Comment |
---|---|---|---|---|---|
Proton affinity (review) | 856.9 | kJ/mol | N/A | Hunter and Lias, 1998 | HL |
Quantity | Value | Units | Method | Reference | Comment |
Gas basicity | 825.0 | kJ/mol | N/A | Hunter and Lias, 1998 | HL |
Ionization energy determinations
IE (eV) | Method | Reference | Comment |
---|---|---|---|
8.797 ± 0.005 | PE | Hernandez, Masclet, et al., 1977 | LLK |

Condensed phase thermochemistry data

Data compiled by: Hussein Y. Afeefy, Joel F. Liebman, and Stephen E. Stein
Quantity | Value | Units | Method | Reference | Comment |
---|---|---|---|---|---|
ΔfH°liquid | -91.20 ± 0.29 | kcal/mol | Ccr | Seller, 1970 | |
Quantity | Value | Units | Method | Reference | Comment |
ΔcH°liquid | -1207.73 ± 0.27 | kcal/mol | Ccr | Seller, 1970 | Corresponding ΔfHºliquid = -91.197 kcal/mol (simple calculation by NIST; no Washburn corrections) |

Phase change data

Data compiled as indicated in comments:
TRC - Thermodynamics Research Center, NIST Boulder Laboratories, Chris Muzny director
BS - Robert L. Brown and Stephen E. Stein
AC - William E. Acree, Jr., James S. Chickos
ALS - Hussein Y. Afeefy, Joel F. Liebman, and Stephen E. Stein
Quantity | Value | Units | Method | Reference | Comment |
---|---|---|---|---|---|
Tboil | 407. ± 5. | K | AVG | N/A | Average of 9 values; Individual data points |
Quantity | Value | Units | Method | Reference | Comment |
Tfus | 244.13 | K | N/A | Howard, Mears, et al., 1947 | Uncertainty assigned by TRC = 0.1 K; TRC |
Quantity | Value | Units | Method | Reference | Comment |
ΔvapH° | 10.3 ± 0.05 | kcal/mol | C | Seller, 1970 | AC |
ΔvapH° | 10.3 ± 0.02 | kcal/mol | C | Wadsö, Murto, et al., 1966 | AC |
ΔvapH° | 10.35 ± 0.03 | kcal/mol | C | Wadso, 1966 | ALS |
Reduced pressure boiling point
Tboil (K) | Pressure (atm) | Reference | Comment |
---|---|---|---|
332.7 | 0.066 | Weast and Grasselli, 1989 | BS |
Enthalpy of vaporization
ΔvapH (kcal/mol) | Temperature (K) | Method | Reference | Comment |
---|---|---|---|---|
13.3 | 302. | A | Stephenson and Malanowski, 1987 | Based on data from 287. to 408. K. See also Stull, 1947.; AC |
Antoine Equation Parameters
log10(P) = A − (B / (T + C))
P = vapor pressure (atm)
T = temperature (K)
View plot Requires a JavaScript / HTML 5 canvas capable browser.
Temperature (K) | A | B | C | Reference | Comment |
---|---|---|---|---|---|
287.9 to 408. | 5.96395 | 2202.715 | -38.782 | Stull, 1947 | Coefficents calculated by NIST from author's data. |

References

Seller, 1970
Seller, P.,
Enthalpies of formation of some aliphatic branched ketones,
J. Chem. Thermodyn., 1970, 2, 211-219. [all data]
Hunter and Lias, 1998
Hunter, E.P.; Lias, S.G.,
Evaluated Gas Phase Basicities and Proton Affinities of Molecules: An Update,
J. Phys. Chem. Ref. Data, 1998, 27, 3, 413-656, https://doi.org/10.1063/1.556018
. [all data]
Hernandez, Masclet, et al., 1977
Hernandez, R.; Masclet, P.; Mouvier, G.,
Spectroscopie de photoelectrons d'aldehydes et de cetones aliphatiques,
J. Electron Spectrosc. Relat. Phenom., 1977, 10, 333. [all data]