Phenol, m-tert-butyl-
- Formula: C10H14O
- Molecular weight: 150.2176
- IUPAC Standard InChIKey: CYEKUDPFXBLGHH-UHFFFAOYSA-N
- CAS Registry Number: 585-34-2
- Chemical structure:
View 3d structure (requires JavaScript / HTML 5) - Other names: Phenol, 3-(1,1-dimethylethyl)-; m-tert-Butylphenol; 3-tert-Butylphenol; 3-t-Butylphenol; Phenol, 3-tert-butyl-

Gas phase thermochemistry data

Data compiled by: Hussein Y. Afeefy, Joel F. Liebman, and Stephen E. Stein
Quantity | Value | Units | Method | Reference | Comment |
---|---|---|---|---|---|
ΔfH°gas | -185.2 | kJ/mol | Eqk | Verevkin, 1982 | |
ΔfH°gas | -184. | kJ/mol | Ccb | Bertholon, Giray, et al., 1971 |

Condensed phase thermochemistry data

Data compiled by: Hussein Y. Afeefy, Joel F. Liebman, and Stephen E. Stein
Quantity | Value | Units | Method | Reference | Comment |
---|---|---|---|---|---|
ΔfH°solid | -280. | kJ/mol | Ccb | Bertholon, Giray, et al., 1971 | |
Quantity | Value | Units | Method | Reference | Comment |
ΔcH°solid | -5661. | kJ/mol | Ccb | Bertholon, Giray, et al., 1971 | Corresponding ΔfHºsolid = -280. kJ/mol (simple calculation by NIST; no Washburn corrections) |

Phase change data

Data compiled as indicated in comments:
AC - William E. Acree, Jr., James S. Chickos
ALS - Hussein Y. Afeefy, Joel F. Liebman, and Stephen E. Stein
DRB - Donald R. Burgess, Jr.
Quantity | Value | Units | Method | Reference | Comment |
---|---|---|---|---|---|
ΔvapH° | 71.3 ± 0.8 | kJ/mol | GS | Verevkin, 1999 | Based on data from 320. to 348. K.; AC |
Quantity | Value | Units | Method | Reference | Comment |
ΔsubH° | 88.9 ± 0.5 | kJ/mol | C | Ribeiro da Silva, Matos, et al., 1999 | AC |
ΔsubH° | 86.0 ± 0.5 | kJ/mol | GS | Verevkin, 1999 | Based on data from 278. to 319. K.; AC |
ΔsubH° | 92.05 | kJ/mol | C | Bertholon, Giray, et al., 1971 | ALS |
ΔsubH° | 96.0 | kJ/mol | N/A | Bertholon, Giray, et al., 1971 | DRB |
Enthalpy of vaporization
ΔvapH (kJ/mol) | Temperature (K) | Method | Reference | Comment |
---|---|---|---|---|
69.1 ± 0.8 | 334. | GS | Verevkin, 1999 | Based on data from 320. to 348. K.; AC |
62.4 | 406. | A | Stephenson and Malanowski, 1987 | Based on data from 391. to 524. K.; AC |
56.6 | 398. | N/A | Stage, Müller, et al., 1953 | Based on data from 391. to 524. K.; AC |
54.4 | 423. | N/A | Stage, Müller, et al., 1953 | Based on data from 391. to 524. K.; AC |
49.9 | 473. | N/A | Stage, Müller, et al., 1953 | Based on data from 391. to 524. K.; AC |
Enthalpy of sublimation
ΔsubH (kJ/mol) | Temperature (K) | Method | Reference | Comment |
---|---|---|---|---|
70.7 | 281. | A | Stephenson and Malanowski, 1987 | Based on data from 266. to 299. K.; AC |

Reaction thermochemistry data

Data compiled as indicated in comments:
B - John E. Bartmess
ALS - Hussein Y. Afeefy, Joel F. Liebman, and Stephen E. Stein
Individual Reactions
C10H13O- + =
By formula: C10H13O- + H+ = C10H14O
Quantity | Value | Units | Method | Reference | Comment |
---|---|---|---|---|---|
ΔrH° | 1458. ± 8.8 | kJ/mol | G+TS | Fujio, McIver, et al., 1981 | gas phase; value altered from reference due to change in acidity scale; B |
Quantity | Value | Units | Method | Reference | Comment |
ΔrG° | 1430. ± 8.4 | kJ/mol | IMRE | Fujio, McIver, et al., 1981 | gas phase; value altered from reference due to change in acidity scale; B |
By formula: C10H14O = C10H14O
Quantity | Value | Units | Method | Reference | Comment |
---|---|---|---|---|---|
ΔrH° | -1.0 | kJ/mol | Eqk | Verevkin, 1982 | gas phase; Isomerization; ALS |
ΔrH° | -1. ± 1.3 | kJ/mol | Eqk | Pil'shchikov, Nesterova, et al., 1981 | liquid phase; ALS |
By formula: C6H6O + C14H22O = C10H14O + C10H14O
Quantity | Value | Units | Method | Reference | Comment |
---|---|---|---|---|---|
ΔrH° | 0.08 ± 0.71 | kJ/mol | Eqk | Pil'shchikov, Nesterova, et al., 1981 | liquid phase; ALS |
By formula: C6H6O + C14H22O = C10H14O + C10H14O
Quantity | Value | Units | Method | Reference | Comment |
---|---|---|---|---|---|
ΔrH° | 0.0 | kJ/mol | Eqk | Pil'shchikov, Nesterova, et al., 1981 | liquid phase; ALS |

Gas phase ion energetics data

Data compiled as indicated in comments:
B - John E. Bartmess
LBLHLM - Sharon G. Lias, John E. Bartmess, Joel F. Liebman, John L. Holmes, Rhoda D. Levin, and W. Gary Mallard
Ionization energy determinations
IE (eV) | Method | Reference | Comment |
---|---|---|---|
8.40 | PE | Cetinkaya, Lappert, et al., 1983 | Vertical value; LBLHLM |
De-protonation reactions
C10H13O- + =
By formula: C10H13O- + H+ = C10H14O
Quantity | Value | Units | Method | Reference | Comment |
---|---|---|---|---|---|
ΔrH° | 1458. ± 8.8 | kJ/mol | G+TS | Fujio, McIver, et al., 1981 | gas phase; value altered from reference due to change in acidity scale; B |
Quantity | Value | Units | Method | Reference | Comment |
ΔrG° | 1430. ± 8.4 | kJ/mol | IMRE | Fujio, McIver, et al., 1981 | gas phase; value altered from reference due to change in acidity scale; B |

Van Den Dool and Kratz RI, non-polar column, custom temperature program

Column type | Active phase | I | Reference | Comment |
---|---|---|---|---|
Capillary | VF-5MS | 1294.7 | Mjøs, Meier, et al., 2006 | 50. m/0.25 mm/0.25 μm, He; Program: 60C(2min) => 30C/min => 100C => 1C/min => |
Capillary | VF-5MS | 1294.8 | Mjøs, Meier, et al., 2006 | 50. m/0.25 mm/0.25 μm, He; Program: 60C(2min) => 30C/min => 100C => 2C/min => |
Capillary | VF-5MS | 1296.7 | Mjøs, Meier, et al., 2006 | 50. m/0.25 mm/0.25 μm, He; Program: 60C(2min) => 30C/min => 100C => 4C/min => |

Normal alkane RI, non-polar column, temperature ramp

Column type | Active phase | I | Reference | Comment |
---|---|---|---|---|
Capillary | Ultra-1 | 1267. | Okumura, 1991 | 25. m/0.32 mm/0.25 μm, He, 3. K/min; Tstart: 80. C; Tend: 260. C |

References

Verevkin, 1982
Verevkin, S.P.,
Study of equilibrium of tert-butylphenol dealkylation in the gas phase,
Termodin. Organ. Soedin., 1982, 67-70. [all data]
Bertholon, Giray, et al., 1971
Bertholon, G.; Giray, M.; Perrin, R.; Vincent-Falquet-Berny, M.F.,
No. 532. - Etude physicochimique des phenols. OX. - Ethanlpies de combustion et energies de resonance des alcoyl et aryphenols,
Bull. Soc. Chim. France, 1971, 3180-3187. [all data]
Verevkin, 1999
Verevkin, S.P.,
Thermochemistry of phenols: quantification of theortho-,para-, andmeta-interactions in tert-alkyl substituted phenols,
The Journal of Chemical Thermodynamics, 1999, 31, 5, 559-585, https://doi.org/10.1006/jcht.1998.0459
. [all data]
Ribeiro da Silva, Matos, et al., 1999
Ribeiro da Silva, M.A.V.; Matos, M.A.R.; Morais, V.M.F.; Miranda, M.S.,
Thermochemical and Theoretical Study of tert -Butyl and Di- tert -butylphenol Isomers,
J. Org. Chem., 1999, 64, 24, 8816-8820, https://doi.org/10.1021/jo990801o
. [all data]
Stephenson and Malanowski, 1987
Stephenson, Richard M.; Malanowski, Stanislaw,
Handbook of the Thermodynamics of Organic Compounds, 1987, https://doi.org/10.1007/978-94-009-3173-2
. [all data]
Stage, Müller, et al., 1953
Stage, H.; Müller, E.; Faldix, P.,
Erdol u Kohle, 1953, 6, 375. [all data]
Fujio, McIver, et al., 1981
Fujio, M.; McIver, R.T., Jr.; Taft, R.W.,
Effects on the acidities of phenols from specific substituent-solvent interactions. Inherent substituent parameters from gas phase acidities,
J. Am. Chem. Soc., 1981, 103, 4017. [all data]
Pil'shchikov, Nesterova, et al., 1981
Pil'shchikov, V.A.; Nesterova, T.N.; Rozhnov, A.M.,
Equilibrium in the system phenol-tert-butylphenols,
J. Appl. Chem. USSR, 1981, 54, 1765-1769. [all data]
Cetinkaya, Lappert, et al., 1983
Cetinkaya, B.; Lappert, M.F.; Suffolk, R.J.,
Photoelectron spectra of some sterically hindered phenols and related compounds,
J. Chem. Res. Synop., 1983, 316. [all data]
Mjøs, Meier, et al., 2006
Mjøs, S.A.; Meier, S.; Boitsov, S.,
Alkylphenol retention indices,
J. Chromatogr. A, 2006, 1123, 1, 98-105, https://doi.org/10.1016/j.chroma.2006.05.002
. [all data]
Okumura, 1991
Okumura, T.,
retention indices of environmental chemicals on methyl silicone capillary column,
Journal of Environmental Chemistry (Japan), 1991, 1, 2, 333-358, https://doi.org/10.5985/jec.1.333
. [all data]