Phenanthrene, 9,10-dihydro-9,10-epoxy-
- Formula: C14H10O
- Molecular weight: 194.2286
- IUPAC Standard InChIKey: PXPGRGGVENWVBD-UHFFFAOYSA-N
- CAS Registry Number: 585-08-0
- Chemical structure:
View 3d structure (requires JavaScript / HTML 5) - Permanent link for this species. Use this link for bookmarking this species for future reference.

Gas phase ion energetics data

Data compiled by: Sharon G. Lias, Rhoda D. Levin, and Sherif A. Kafafi
Ionization energy determinations
IE (eV) | Method | Reference | Comment |
---|---|---|---|
8.19 | PE | Akiyama, Li, et al., 1979 | Vertical value |
8.24 | DER | Shudo, Kobayashi, et al., 1977 | Vertical value |

References

Akiyama, Li, et al., 1979
Akiyama, I.; Li, K.C.; LeBreton, P.R.; Fu, P.P.; Harvey, R.G.,
Ultraviolet photoelectron studies of polycyclic aromatic hydrocarbons. The ground-state electronic structure of aryloxiranes and metabolites of benzo[a]pyrene,
J. Phys. Chem., 1979, 83, 2997. [all data]
Shudo, Kobayashi, et al., 1977
Shudo, K.; Kobayashi, T.; Utsunomiya, C.,
Photoelectron spectral studies on the interaction of three-membered rings with aryl groups,
Tetrahedron, 1977, 33, 1721. [all data]