Tri(N,N-di-n-propylamino)phosphine
- Formula: C18H42N3P
- Molecular weight: 331.5199
- IUPAC Standard InChIKey: KPDXRSBWIPGWLS-UHFFFAOYSA-N
- CAS Registry Number: 5848-64-6
- Chemical structure:
View 3d structure (requires JavaScript / HTML 5) - Other names: Tris(N,N-di-n-propylamino)phosphine; P(N(n-C3H7)2)3; Tris(dipropylamino)phosphine; Hexa-n-propyl phosphorous triamide; Phosphine, tris(dipropylamino)-

Phase change data

Data compiled by: Robert L. Brown and Stephen E. Stein
Reduced pressure boiling point
Tboil (K) | Pressure (bar) | Reference |
---|---|---|
418. to 421. | 0.003 | Frinton Laboratories Inc., 1986 |

Gas phase ion energetics data

Data compiled as indicated in comments:
LBLHLM - Sharon G. Lias, John E. Bartmess, Joel F. Liebman, John L. Holmes, Rhoda D. Levin, and W. Gary Mallard
Ionization energy determinations
IE (eV) | Method | Reference | Comment |
---|---|---|---|
7.05 | PE | Worley, Hargis, et al., 1982 | Vertical value; LBLHLM |

References

Frinton Laboratories Inc., 1986
Frinton Laboratories Inc.,
Catalog Number 11, Frinton Laboratories Inc., Vineland, NJ, 1986, 99. [all data]
Worley, Hargis, et al., 1982
Worley, S.D.; Hargis, J.H.; Chang, L.; Mattson, G.A.; Jennings, W.B.,
The UPS of some compounds containing the heteroatoms phosphorus, nitrogen and oxygen,
J. Electron Spectrosc. Relat. Phenom., 1982, 25, 135. [all data]