(E,E)-1,3,5-Heptatriene, 5-methyl-
- Formula: C8H12
- Molecular weight: 108.1809
- IUPAC Standard InChIKey: HBOBXPNYRYGOCI-ZCOYIIAOSA-N
- CAS Registry Number: 58434-77-8
- Chemical structure:
View 3d structure (requires JavaScript / HTML 5) - Species with the same structure:

Gas phase ion energetics data

Data compiled as indicated in comments:
LLK - Sharon G. Lias, Rhoda D. Levin, and Sherif A. Kafafi
Appearance energy determinations
Ion | AE (eV) | Other Products | Method | Reference | Comment |
---|---|---|---|---|---|
C8H12+ | 8.01 | ? | PE | Astrup, Bock, et al., 1975 | Vertical value; LLK |

References

Astrup, Bock, et al., 1975
Astrup, E.E.; Bock, H.; Wittel, K.; Heimbach, P.,
Photoelectron spectra and molecular properties. LIII. Methyl-substituent effects on the hexatriene π system,
Acta Chem. Scand. Ser. A:, 1975, 29, 827. [all data]