Thiophene, 2,5-dimethoxy-
- Formula: C6H8O2S
- Molecular weight: 144.192
- IUPAC Standard InChIKey: FPRUDKWOQNIYOG-UHFFFAOYSA-N
- CAS Registry Number: 58386-20-2
- Chemical structure:
View 3d structure (requires JavaScript / HTML 5) - Permanent link for this species. Use this link for bookmarking this species for future reference.

Gas phase ion energetics data

Data compiled by: Sharon G. Lias, John E. Bartmess, Joel F. Liebman, John L. Holmes, Rhoda D. Levin, and W. Gary Mallard
Ionization energy determinations
IE (eV) | Method | Reference | Comment |
---|---|---|---|
7.3 | PE | Bajic, Humski, et al., 1985 | |
7.82 | PE | Bajic, Humski, et al., 1985 | Vertical value |

References

Bajic, Humski, et al., 1985
Bajic, M.; Humski, K.; Klasinc, L.; Ruscic, B.,
Substitution effects on electronic structure of thiophene,
Z. Naturforsch. B:, 1985, 40, 1214. [all data]