Cyclohexanone, 2-methyl-
- Formula: C7H12O
- Molecular weight: 112.1696
- IUPAC Standard InChIKey: LFSAPCRASZRSKS-UHFFFAOYSA-N
- CAS Registry Number: 583-60-8
- Chemical structure:
View 3d structure (requires JavaScript / HTML 5) - Species with the same structure:
- Other names: α-Methylcyclohexanone; 2-Methyl-1-cyclohexanone; 2-Methylcyclohexanone; o-Methylcyclohexanone; 2-Methyl-cyclohexanon; 2-Metilcicloesanone

Condensed phase thermochemistry data

Data compiled by: Eugene S. Domalski and Elizabeth D. Hearing
Constant pressure heat capacity of liquid
Cp,liquid (J/mol*K) | Temperature (K) | Reference |
---|---|---|
204.6 | 290. | Herz and Bloch, 1924 |

Phase change data

Data compiled as indicated in comments:
TRC - Thermodynamics Research Center, NIST Boulder Laboratories, Chris Muzny director
BS - Robert L. Brown and Stephen E. Stein
AC - William E. Acree, Jr., James S. Chickos
Quantity | Value | Units | Method | Reference | Comment |
---|---|---|---|---|---|
Tboil | 391.65 | K | N/A | CruzBurguet, Monton, et al., 1993 | Uncertainty assigned by TRC = 0.25 K; TRC |
Tboil | 435.7 | K | N/A | Aldrich Chemical Company Inc., 1990 | BS |
Tboil | 438.2 | K | N/A | White and Bishop, 1940 | Uncertainty assigned by TRC = 0.5 K; TRC |
Tboil | 373.4 | K | N/A | Cowan, Jeffery, et al., 1939 | Uncertainty assigned by TRC = 0.8 K; TRC |
Tboil | 439. | K | N/A | Zelinskii, 1897 | Uncertainty assigned by TRC = 6. K; TRC |
Quantity | Value | Units | Method | Reference | Comment |
Tfus | 264.00 | K | N/A | Plate, Liberman, et al., 1953 | Uncertainty assigned by TRC = 2. K; TRC |
Tfus | 259.25 | K | N/A | Timmermans, 1952 | Uncertainty assigned by TRC = 0.4 K; TRC |
Tfus | 256. | K | N/A | White and Bishop, 1940 | Uncertainty assigned by TRC = 6. K; TRC |
Quantity | Value | Units | Method | Reference | Comment |
ΔvapH° | 44.0 | kJ/mol | EB | Palczewska-Tulinska and Oracz, 2006 | Based on data from 339. to 437. K.; AC |
Enthalpy of vaporization
ΔvapH (kJ/mol) | Temperature (K) | Reference | Comment |
---|---|---|---|
45.0 | 346. | Cruz Burguet, Monton, et al., 1993 | Based on data from 331. to 437. K.; AC |

Reaction thermochemistry data

Data compiled by: Hussein Y. Afeefy, Joel F. Liebman, and Stephen E. Stein
Individual Reactions
By formula: C7H14O = H2 + C7H12O
Quantity | Value | Units | Method | Reference | Comment |
---|---|---|---|---|---|
ΔrH° | 62.5 ± 2.3 | kJ/mol | Eqk | Fedoseenko, Yursha, et al., 1983 | gas phase; At 493 K |
By formula: C7H14O = H2 + C7H12O
Quantity | Value | Units | Method | Reference | Comment |
---|---|---|---|---|---|
ΔrH° | 66.6 ± 2.4 | kJ/mol | Eqk | Fedoseenko, Yursha, et al., 1983 | gas phase; At 493 K |
By formula: H2 + C7H12O = C7H14O
Quantity | Value | Units | Method | Reference | Comment |
---|---|---|---|---|---|
ΔrH° | -66.36 | kJ/mol | Chyd | Dokuchaeva, Sibarov, et al., 1981 | liquid phase |

Gas phase ion energetics data

Data compiled as indicated in comments:
LLK - Sharon G. Lias, Rhoda D. Levin, and Sherif A. Kafafi
B - John E. Bartmess
Electron affinity determinations
EA (eV) | Reference | Comment |
---|---|---|
0.004207 ± 0.000087 | Hammer, Diri, et al., 2003 | B |
Ionization energy determinations
IE (eV) | Method | Reference | Comment |
---|---|---|---|
9.05 | PE | Loudet, Grimaud, et al., 1976 | LLK |
9.5 ± 0.2 | EI | Fortin, Forest, et al., 1973 | LLK |

Kovats' RI, non-polar column, isothermal

Column type | Active phase | Temperature (C) | I | Reference | Comment |
---|---|---|---|---|---|
Capillary | SE-30 | 100. | 935. | Golovnya, Syomina, et al., 1997 | 25. m/0.32 mm/1. μm, He |
Capillary | SE-30 | 110. | 937. | Golovnya, Syomina, et al., 1997 | 25. m/0.32 mm/1. μm, He |
Capillary | SE-30 | 80. | 929. | Golovnya, Syomina, et al., 1997 | 25. m/0.32 mm/1. μm, He |
Capillary | SE-30 | 90. | 932. | Golovnya, Syomina, et al., 1997 | 25. m/0.32 mm/1. μm, He |
Packed | Apiezon L | 130. | 954. | Paris and Alexandre, 1972 | Chromosorb W AW |
Packed | Apiezon L | 130. | 937. | Wehrli and Kováts, 1959 | Celite; Column length: 2.25 m |

Normal alkane RI, non-polar column, isothermal

Column type | Active phase | Temperature (C) | I | Reference | Comment |
---|---|---|---|---|---|
Capillary | DB-1 | 60. | 914. | Shimadzu, 2003 | 60. m/0.32 mm/1. μm, He |
Capillary | DB-1 | 80. | 924. | Shimadzu, 2003 | 60. m/0.32 mm/1. μm, He |

Normal alkane RI, non-polar column, temperature ramp

Column type | Active phase | I | Reference | Comment |
---|---|---|---|---|
Capillary | VF-5 MS | 949. | Leffingwell and Alford, 2011 | 60. m/0.32 mm/0.25 μm, Helium, 2. K/min, 260. C @ 28. min; Tstart: 30. C |
Capillary | VF-5 MS | 954. | Leffingwell and Alford, 2011 | 60. m/0.32 mm/0.25 μm, Helium, 2. K/min, 260. C @ 28. min; Tstart: 30. C |
Capillary | HP-5 | 953.1 | Leffingwell and Alford, 2005 | 60. m/0.32 mm/0.25 μm, He, 30. C @ 2. min, 2. K/min, 260. C @ 28. min |
Capillary | BP-1 | 930. | Health Safety Executive, 2000 | 50. m/0.22 mm/0.75 μm, He, 5. K/min; Tstart: 50. C; Tend: 200. C |

References

Herz and Bloch, 1924
Herz, W.; Bloch, W.,
Physikalisch-chemische Untersuchungen an Verbindungen der Cyklohexanreihe,
Z. Phys. Chem., 1924, 110, 23-39. [all data]
CruzBurguet, Monton, et al., 1993
CruzBurguet, M.; Monton, J.B.; Sancho-Tello, M.; Vazquez, M.I.,
Vapor-liquid equilibria of cyclohexanone + cyclohexanol and cyclohexanone + 2-methylcyclohexanone systems at 4.00 and 26.66 kPa,
J. Chem. Eng. Data, 1993, 38, 328-31. [all data]
Aldrich Chemical Company Inc., 1990
Aldrich Chemical Company Inc.,
Catalog Handbook of Fine Chemicals, Aldrich Chemical Company, Inc., Milwaukee WI, 1990, 1. [all data]
White and Bishop, 1940
White, A.H.; Bishop, W.S.,
Dielectric Evidence of Molecular Rotation in the Crystals of Certain Non-aromatic Compounds,
J. Am. Chem. Soc., 1940, 62, 8-16. [all data]
Cowan, Jeffery, et al., 1939
Cowan, D.M.; Jeffery, G.H.; Vogel, A.I.,
Physical properties and chemical constitution. Part 4. Methylcyclohexane and the multiplanar structure of the methylcyclohexane ring.,
J. Chem. Soc., 1939, 1939, 1862-5. [all data]
Zelinskii, 1897
Zelinskii, N.D.,
Experiments in the Hexamethylene Series,
Ber. Dtsch. Chem. Ges., 1897, 30, 387-91. [all data]
Plate, Liberman, et al., 1953
Plate, A.F.; Liberman, A.L.; Momma, N.A.,
Preparation of 1,2-Dialkylcycloanes. Synthesis of Stereoisomeric 1-Methyl-2-butylcyclopentanes,
Izv. Akad. Nauk SSSR, 1953, 1953, 689. [all data]
Timmermans, 1952
Timmermans, J.,
Freezing points of organic compounds. VVI New determinations.,
Bull. Soc. Chim. Belg., 1952, 61, 393. [all data]
Palczewska-Tulinska and Oracz, 2006
Palczewska-Tulinska, Marcela; Oracz, Pawel,
Vapor Pressures of Hexanal, 2-Methylcyclohexanone, and 2-Cyclohexen-1-one,
J. Chem. Eng. Data, 2006, 51, 2, 639-641, https://doi.org/10.1021/je0504358
. [all data]
Cruz Burguet, Monton, et al., 1993
Cruz Burguet, M.; Monton, Juan B.; Sanchotello, Margarita; Vazquez, M. Isabel,
Vapor-liquid equilibria of cyclohexanone + cyclohexanol and cyclohexanone + 2-methylcyclohexanone systems at 4.00 and 26.66 kPa,
J. Chem. Eng. Data, 1993, 38, 2, 328-331, https://doi.org/10.1021/je00010a037
. [all data]
Fedoseenko, Yursha, et al., 1983
Fedoseenko, V.I.; Yursha, I.A.; Kabo, G.Ya.,
Equilibrium and thermodynamics of cyclohexanol dehydrogenation reactions,
Dokl. Akad. Nauk BSSR, 1983, 27, 926-929. [all data]
Dokuchaeva, Sibarov, et al., 1981
Dokuchaeva, T.G.; Sibarov, d.A.; Timofeev, V.F.; Proskuryakov, V.A.,
Kinetics of the dehydrogenation of 2-methylcyclohexanol to 2-methylcyclohexanone over a platinum catalyst,
J. Appl. Chem. USSR, 1981, 54, 1140-1146. [all data]
Hammer, Diri, et al., 2003
Hammer, N.I.; Diri, K.; Jordan, K.D.; Desfrancois, C.; Compton, R.N.,
Dipole-bound anions of carbonyl, nitrile, and sulfoxide containing molecules,
J. Chem. Phys., 2003, 119, 7, 3650-3660, https://doi.org/10.1063/1.1590959
. [all data]
Loudet, Grimaud, et al., 1976
Loudet, M.; Grimaud, M.; Metras, F.; Pfister-Guillouzo, G.,
Interactions intramoleculaires en serie cyclohexanique partie II. Spectres photoelectroniques de chloro-2-cyclohexanones,
J. Mol. Struct., 1976, 35, 213. [all data]
Fortin, Forest, et al., 1973
Fortin, C.J.; Forest, M.; Vaziri, C.; Gravel, D.; Rousseau, Y.,
Spectrometrie de masse des cyclohexanones gem-diphenylees. I. Localisation de la charge positive,
Can. J. Chem., 1973, 51, 3445. [all data]
Golovnya, Syomina, et al., 1997
Golovnya, R.V.; Syomina, L.A.; Samusenko, A.L.,
Temperature changes of sorption parameters of di-n-alkylketones and methylcyclohexanones in capillary gas chromatography,
Russ. Chem. Bull. (Engl. Transl.), 1997, 46, 2, 314-318, https://doi.org/10.1007/BF02494370
. [all data]
Paris and Alexandre, 1972
Paris, C.; Alexandre, P.,
Stereochemical Investigation of Cyclohexane and Terpene Compounds by Gas Chromatography,
J. Chromatogr. Sci., 1972, 10, 6, 402-411, https://doi.org/10.1093/chromsci/10.6.402
. [all data]
Wehrli and Kováts, 1959
Wehrli, A.; Kováts, E.,
Gas-chromatographische Charakterisierung ogranischer Verbindungen. Teil 3: Berechnung der Retentionsindices aliphatischer, alicyclischer und aromatischer Verbindungen,
Helv. Chim. Acta, 1959, 7, 7, 2709-2736, https://doi.org/10.1002/hlca.19590420745
. [all data]
Shimadzu, 2003
Shimadzu,
Gas chromatography analysis of organic solvents using capillary columns (No. 3), 2003, retrieved from http://www.shimadzu.com/apps/form.cfm. [all data]
Leffingwell and Alford, 2011
Leffingwell, J.; Alford, E.D.,
Volatile constituents of the giant pufball mushroom (Calvatia gigantea),
Leffingwell Rep., 2011, 4, 1-17. [all data]
Leffingwell and Alford, 2005
Leffingwell, J.C.; Alford, E.D.,
Volatile constituents of Perique tobacco,
Electron. J. Environ. Agric. Food Chem., 2005, 4, 2, 899-915. [all data]
Health Safety Executive, 2000
Health Safety Executive,
MDHS 96 Volatile organic compounds in air - Laboratory method using pumed solid sorbent tubes, solvent desorption and gas chromatography
in Methods for the Determination of Hazardous Substances (MDHS) guidance, Crown, Colegate, Norwich, 2000, 1-24, retrieved from http://www.hse.gov.uk/pubns/mdhs/pdfs/mdhs96.pdf. [all data]