Pyridine, 3,4-dimethyl-
- Formula: C7H9N
- Molecular weight: 107.1531
- IUPAC Standard InChIKey: NURQLCJSMXZBPC-UHFFFAOYSA-N
- CAS Registry Number: 583-58-4
- Chemical structure:
View 3d structure (requires JavaScript / HTML 5) - Other names: 3,4-Lutidine; 3,4-Dimethylpyridine; 3,4-Lutidene

Gas phase thermochemistry data

Data compiled by: Donald R. Burgess, Jr.
Quantity | Value | Units | Method | Reference | Comment |
---|---|---|---|---|---|
ΔfH°gas | 70.0 | kJ/mol | N/A | Cox and Gundry, 1958 | Value computed using ΔfHliquid° value of 18.2 kj/mol from Cox and Gundry, 1958 and ΔvapH° value of 51.8 kj/mol from missing citation. |

Condensed phase thermochemistry data

Data compiled as indicated in comments:
ALS - Hussein Y. Afeefy, Joel F. Liebman, and Stephen E. Stein
DH - Eugene S. Domalski and Elizabeth D. Hearing
Quantity | Value | Units | Method | Reference | Comment |
---|---|---|---|---|---|
ΔfH°liquid | 18.2 | kJ/mol | Ccb | Cox and Gundry, 1958 | ALS |
Quantity | Value | Units | Method | Reference | Comment |
ΔcH°liquid | -4059.1 | kJ/mol | Ccb | Cox and Gundry, 1958 | ALS |
Quantity | Value | Units | Method | Reference | Comment |
S°liquid | 240.72 | J/mol*K | N/A | Steele, Chirico, et al., 1986 | DH |
Constant pressure heat capacity of liquid
Cp,liquid (J/mol*K) | Temperature (K) | Reference | Comment |
---|---|---|---|
191.84 | 298.15 | Steele, Chirico, et al., 1986 | T = 10 to 450 K.; DH |
196. | 298. | Podoski, Rachwalska, et al., 1984 | T = 265 to 380 K. Data graphically only. Value given is estimated from graph.; DH |

Phase change data

Data compiled as indicated in comments:
BS - Robert L. Brown and Stephen E. Stein
TRC - Thermodynamics Research Center, NIST Boulder Laboratories, Chris Muzny director
ALS - Hussein Y. Afeefy, Joel F. Liebman, and Stephen E. Stein
AC - William E. Acree, Jr., James S. Chickos
DH - Eugene S. Domalski and Elizabeth D. Hearing
Quantity | Value | Units | Method | Reference | Comment |
---|---|---|---|---|---|
Tboil | 436.7 | K | N/A | Weast and Grasselli, 1989 | BS |
Tboil | 452.3 | K | N/A | Majer and Svoboda, 1985 | |
Quantity | Value | Units | Method | Reference | Comment |
Tfus | 262.11 | K | N/A | Coulson, Cox, et al., 1959 | Uncertainty assigned by TRC = 0.05 K; TRC |
Quantity | Value | Units | Method | Reference | Comment |
Ttriple | 262.70 | K | N/A | Chirico, Hossenlopp, et al., 1994 | Uncertainty assigned by TRC = 0.01 K; TRC |
Quantity | Value | Units | Method | Reference | Comment |
Tc | 683.8 | K | N/A | Majer and Svoboda, 1985 | |
Tc | 683.71 | K | N/A | Ambrose, Cox, et al., 1960 | Uncertainty assigned by TRC = 0.4 K; Visual, PRT, IPTS-48, with decomp.; TRC |
Tc | 683.75 | K | N/A | Cox, 1960 | Uncertainty assigned by TRC = 1. K; measured by R. Townsend to be pub. later; TRC |
Quantity | Value | Units | Method | Reference | Comment |
ΔvapH° | 50.54 | kJ/mol | N/A | Majer and Svoboda, 1985 | |
ΔvapH° | 51.80 | kJ/mol | E | Cox, 1960 | ALS |
Enthalpy of vaporization
ΔvapH (kJ/mol) | Temperature (K) | Method | Reference | Comment |
---|---|---|---|---|
39.99 | 452.3 | N/A | Majer and Svoboda, 1985 | |
47.6 | 355. | N/A | Sakoguchi, Ueoka, et al., 1995 | Based on data from 288. to 422. K.; AC |
46.6 | 360. | EB | Steele, Chirico, et al., 1995 | Based on data from 341. to 495. K.; AC |
44.2 | 400. | EB | Steele, Chirico, et al., 1995 | Based on data from 341. to 495. K.; AC |
41.7 | 440. | EB | Steele, Chirico, et al., 1995 | Based on data from 341. to 495. K.; AC |
39.0 | 480. | EB | Steele, Chirico, et al., 1995 | Based on data from 341. to 495. K.; AC |
44.8 | 400. | A | Stephenson and Malanowski, 1987 | Based on data from 385. to 454. K. See also Kkykj and Repas, 1973.; AC |
48.8 | 328. | C | Majer, Svoboda, et al., 1985 | AC |
47.6 | 343. | C | Majer, Svoboda, et al., 1985 | AC |
45.9 | 368. | C | Majer, Svoboda, et al., 1985 | AC |
Enthalpy of vaporization
ΔvapH =
A exp(-βTr) (1 − Tr)β
ΔvapH =
Enthalpy of vaporization (at saturation pressure)
(kJ/mol)
Tr = reduced temperature (T / Tc)
View plot Requires a JavaScript / HTML 5 canvas capable browser.
Temperature (K) | A (kJ/mol) | β | Tc (K) | Reference | Comment |
---|---|---|---|---|---|
328. to 368. | 69.65 | 0.3181 | 683.8 | Majer and Svoboda, 1985 |
Antoine Equation Parameters
log10(P) = A − (B / (T + C))
P = vapor pressure (bar)
T = temperature (K)
View plot Requires a JavaScript / HTML 5 canvas capable browser.
Temperature (K) | A | B | C | Reference | Comment |
---|---|---|---|---|---|
446.3 to 453.50 | 4.20691 | 1618.466 | -67.044 | Coulson, Cox, et al., 1959, 2 | Coefficents calculated by NIST from author's data. |
Enthalpy of fusion
ΔfusH (kJ/mol) | Temperature (K) | Reference | Comment |
---|---|---|---|
14.7 | 262.7 | Chirico, Hossenlopp, et al., 1994, 2 | AC |
Temperature of phase transition
Ttrs (K) | Initial Phase | Final Phase | Reference | Comment |
---|---|---|---|---|
241.100 | crystaline, II | crystaline, I | Steele, Chirico, et al., 1986 | DH |
262.704 | crystaline, I | liquid | Steele, Chirico, et al., 1986 | DH |

Henry's Law data

Data compiled by: Rolf Sander
Henry's Law constant (water solution)
kH(T) = k°H exp(d(ln(kH))/d(1/T) ((1/T) - 1/(298.15 K)))
k°H = Henry's law constant for solubility in water at 298.15 K (mol/(kg*bar))
d(ln(kH))/d(1/T) = Temperature dependence constant (K)
k°H (mol/(kg*bar)) | d(ln(kH))/d(1/T) (K) | Method | Reference |
---|---|---|---|
270. | 6900. | M | N/A |

Gas phase ion energetics data

Data evaluated as indicated in comments:
HL - Edward P. Hunter and Sharon G. Lias
Data compiled as indicated in comments:
LLK - Sharon G. Lias, Rhoda D. Levin, and Sherif A. Kafafi
Quantity | Value | Units | Method | Reference | Comment |
---|---|---|---|---|---|
Proton affinity (review) | 957.3 | kJ/mol | N/A | Hunter and Lias, 1998 | HL |
Quantity | Value | Units | Method | Reference | Comment |
Gas basicity | 925.5 | kJ/mol | N/A | Hunter and Lias, 1998 | HL |
Ionization energy determinations
IE (eV) | Method | Reference | Comment |
---|---|---|---|
9.3 | PE | Aue and Bowers, 1979 | Vertical value; LLK |
9.15 | PE | Ramsey and Walker, 1974 | Vertical value; LLK |

Normal alkane RI, polar column, custom temperature program

Data compiled by: NIST Mass Spectrometry Data Center, William E. Wallace, director

Column type CapillaryCapillaryCapillaryCapillaryCapillary
Active phase CarbowaxCarbowaxCarbowaxCarbowaxCarbowax
Column length (m)
Carrier gas
Substrate
Column diameter (mm)
Phase thickness (μm)
Program not specifiednot specifiednot specifiednot specifiednot specified
I 1466.1468.1468.1469.1471.
ReferenceBaltes and Bochmann, 1987Baltes and Bochmann, 1987Baltes and Bochmann, 1987Baltes and Bochmann, 1987Baltes and Bochmann, 1987
Comment MSDC-RI MSDC-RI MSDC-RI MSDC-RI MSDC-RI

Van Den Dool and Kratz RI, polar column, temperature ramp

Data compiled by: NIST Mass Spectrometry Data Center, William E. Wallace, director

Column type CapillaryCapillaryCapillaryCapillaryCapillary
Active phase DB-WaxPEG-40MPEG-40MPEG-40MCAM
Column length (m) 60.25.25.25.15.
Carrier gas HeHeHeHeHe
Substrate
Column diameter (mm) 0.250.320.320.320.24
Phase thickness (μm) 0.250.800.800.80
Tstart (C) 40.100.70.80.60.
Tend (C) 200.   240.
Heat rate (K/min) 2.2.8.4.5.
Initial hold (min) 5.   5.
Final hold (min) 30.   21.
I 1455.1473.1483.1470.1444.
ReferenceKim, 2001Golovnya, Samusenko, et al., 1988Golovnya, Samusenko, et al., 1988Golovnya, Samusenko, et al., 1988Premecz and Ford, 1987
Comment MSDC-RI MSDC-RI MSDC-RI MSDC-RI MSDC-RI

Normal alkane RI, non-polar column, custom temperature program

Data compiled by: NIST Mass Spectrometry Data Center, William E. Wallace, director

Column type Capillary
Active phase SE-30
Column length (m)
Carrier gas
Substrate
Column diameter (mm)
Phase thickness (μm)
Program not specified
I 1040.
ReferenceLi, Gao, et al., 2000
Comment MSDC-RI

References

Cox and Gundry, 1958
Cox, J.D.; Gundry, H.A.,
Heats of combustion. Part II. The six lutidines,
J. Chem. Soc., 1958, 1019-1022. [all data]
Steele, Chirico, et al., 1986
Steele, W.V.; Chirico, R.D.; Collier, W.B.; Hossenlopp, I.A.; Nguyen, A.; Strube, M.M.,
Thermochemical and thermophysical properties of organic nitrogen compounds found in fossil materials,
NIPER Report, 1986, 188, 112p. [all data]
Podoski, Rachwalska, et al., 1984
Podoski, T.; Rachwalska, M.; Mayer, J.,
The study of specific heat of liquid 3,4-dimethylpyridine by the adiabatic calorimetry method,
Physica B (Amsterdam), 1984, 125(2), 215-218. [all data]
Weast and Grasselli, 1989
CRC Handbook of Data on Organic Compounds, 2nd Editon, Weast,R.C and Grasselli, J.G., ed(s)., CRC Press, Inc., Boca Raton, FL, 1989, 1. [all data]
Majer and Svoboda, 1985
Majer, V.; Svoboda, V.,
Enthalpies of Vaporization of Organic Compounds: A Critical Review and Data Compilation, Blackwell Scientific Publications, Oxford, 1985, 300. [all data]
Coulson, Cox, et al., 1959
Coulson, E.A.; Cox, J.D.; Herington, E.F.G.; Martin, J.F.,
The Preparation and Physical Properties of the Pure Lutidines,
J. Chem. Soc., 1959, 1959, 1934. [all data]
Chirico, Hossenlopp, et al., 1994
Chirico, R.D.; Hossenlopp, I.A.; Gammon, B.E.; Knipmeyer, S.E.; Steele, W.V.,
Heat capacities of the six dimethylpyridines between the temperatures 10 K and 445 K and methyl-group rotational barriers in the solid state a,b,
J. Chem. Thermodyn., 1994, 26, 11, 1187, https://doi.org/10.1006/jcht.1994.1138
. [all data]
Ambrose, Cox, et al., 1960
Ambrose, D.; Cox, J.D.; Townsend, R.,
The critical temperatures of forty organic compounds,
Trans. Faraday Soc., 1960, 56, 1452. [all data]
Cox, 1960
Cox, J.D.,
The second virial coefficients, latent heats of vaporization and heats of formation of the lutidines,
Trans. Faraday Soc., 1960, 56, 959. [all data]
Sakoguchi, Ueoka, et al., 1995
Sakoguchi, Akihiro; Ueoka, Ryuichi; Kato, Yasuo; Arai, Yasuhiko,
Vapor Pressures of Alkylpyridines and Alkylpyrazines.,
KAGAKU KOGAKU RONBUNSHU, 1995, 21, 1, 219-223, https://doi.org/10.1252/kakoronbunshu.21.219
. [all data]
Steele, Chirico, et al., 1995
Steele, W.V.; Chirico, R.D.; Nguyen, A.; Knipmeyer, S.E.,
Vapor pressures, high-temperature heat capacities, critical properties, derived thermodynamic functions, and barriers to methyl-group rotation, for the six dimethylpyridines,
The Journal of Chemical Thermodynamics, 1995, 27, 3, 311-334, https://doi.org/10.1006/jcht.1995.0030
. [all data]
Stephenson and Malanowski, 1987
Stephenson, Richard M.; Malanowski, Stanislaw,
Handbook of the Thermodynamics of Organic Compounds, 1987, https://doi.org/10.1007/978-94-009-3173-2
. [all data]
Kkykj and Repas, 1973
Kkykj, J.; Repas, M.,
Petrochemia, 1973, 13, 179. [all data]
Majer, Svoboda, et al., 1985
Majer, V.; Svoboda, V.; Lencka, M.,
Enthalpies of vaporization and cohesive energies of dimethylpyridines and trimethylpyridines,
The Journal of Chemical Thermodynamics, 1985, 17, 4, 365-370, https://doi.org/10.1016/0021-9614(85)90133-8
. [all data]
Coulson, Cox, et al., 1959, 2
Coulson, E.A.; Cox, J.D.; Herington, E.F.G.; Martin, J.F.,
The Preparation and Physical Properties of the Pure Lutidines,
J. Chem. Soc., 1959, 1934-1940, https://doi.org/10.1039/jr9590001934
. [all data]
Chirico, Hossenlopp, et al., 1994, 2
Chirico, R.D.; Hossenlopp, I.A.; Gammon, B.E.; Knipmeyer, S.E.; Steele, W.V.,
Heat capacities of the six dimethylpyridines between the temperatures 10 K and 445 K and methyl-group rotational barriers in the solid state a,b,
The Journal of Chemical Thermodynamics, 1994, 26, 11, 1187-1218, https://doi.org/10.1006/jcht.1994.1138
. [all data]
Hunter and Lias, 1998
Hunter, E.P.; Lias, S.G.,
Evaluated Gas Phase Basicities and Proton Affinities of Molecules: An Update,
J. Phys. Chem. Ref. Data, 1998, 27, 3, 413-656, https://doi.org/10.1063/1.556018
. [all data]
Aue and Bowers, 1979
Aue, D.H.; Bowers, M.T.,
Chapter 9. Stabilities of positive ions from equilibrium gas phase basicity measurements
in Ions Chemistry,, ed. M.T. Bowers, 1979. [all data]
Ramsey and Walker, 1974
Ramsey, B.G.; Walker, F.A.,
A linear relationship between substituted pyridine lone pair vertical ionization potentials and pKa,
J. Am. Chem. Soc., 1974, 96, 3314. [all data]