3-(4-Chlorophenyl)butanoic acid methyl ester
- Formula: C11H13ClO2
- Molecular weight: 212.673
- IUPAC Standard InChIKey: FFALEYDWSBKJHW-UHFFFAOYSA-N
- CAS Registry Number: 58304-70-4
- Chemical structure:
View 3d structure (requires JavaScript / HTML 5) - Permanent link for this species. Use this link for bookmarking this species for future reference.

Gas phase ion energetics data

Data compiled by: Henry M. Rosenstock, Keith Draxl, Bruce W. Steiner, and John T. Herron
Ionization energy determinations
IE (eV) | Method | Reference |
---|---|---|
8.4 ± 0.2 | EI | Howe, Williams, et al., 1969 |
Appearance energy determinations
Ion | AE (eV) | Other Products | Method | Reference | Comment |
---|---|---|---|---|---|
C8H8Cl+ | 11.1 ± 0.2 | ? | EI | Howe, Williams, et al., 1969 | |
C9H9Cl+ | 9.9 ± 0.2 | ? | EI | Howe, Williams, et al., 1969 | |
C10H10OCl+ | 11.1 ± 0.2 | CH3O | EI | Howe, Williams, et al., 1969 |

References

Howe, Williams, et al., 1969
Howe, I.; Williams, D.H.; Kingston, D.G.I.; Tannenbaum, H.P.,
Substituent effects in the mass spectra of some - and -substituted methyl butyrates,
J. Chem. Soc. B, 1969, 439. [all data]