2-Cyclopropen-1-one,2,3-bis(1-methylcyclopropyl)-
- Formula: C11H14O
- Molecular weight: 162.2283
- IUPAC Standard InChIKey: OJYNBBXPTVFYDN-UHFFFAOYSA-N
- CAS Registry Number: 58287-34-6
- Chemical structure:
View 3d structure (requires JavaScript / HTML 5) - Permanent link for this species. Use this link for bookmarking this species for future reference.

Gas phase ion energetics data

Data compiled by: Sharon G. Lias, Rhoda D. Levin, and Sherif A. Kafafi
Ionization energy determinations
IE (eV) | Method | Reference | Comment |
---|---|---|---|
8.44 | PE | Dehmlow, Dehmlow, et al., 1977 | Vertical value |

References

Dehmlow, Dehmlow, et al., 1977
Dehmlow, E.V.; Dehmlow, S.S.; Marschner, F.,
Chemische und photoelektronenspektroskopische Eigenschaften von cyclopropylsubstituierten Cyclopropenonen,
Chem. Ber., 1977, 110, 154. [all data]