Menadione
- Formula: C11H8O2
- Molecular weight: 172.1800
- IUPAC Standard InChIKey: MJVAVZPDRWSRRC-UHFFFAOYSA-N
- CAS Registry Number: 58-27-5
- Chemical structure:
View 3d structure (requires JavaScript / HTML 5) - Other names: 1,4-Naphthalenedione, 2-methyl-; 1,4-Naphthoquinone, 2-methyl-; Aquakay; Aquinone; Hemodal; K-Thrombyl; K-Vitan; Kaergona; Kanone; Kappaxan; Kappaxin; Karcon; Kareon; Kativ-G; Kayklot; Kaykot; Kayquinone; Kipca; Kipca-Oil Soluble; Klottone; Koaxin; Kolklot; Menadion; Menaphthon; Menaphthone; Menaquinone; Mitenon; Mitenone; MNQ; Panosine; Prokayvit; Synkay; Thyloquinone; Vitamin K2(0); Vitamin K3; 2-Methyl-1,4-Naphthalenedione; 2-Methyl-1,4-naphthoquinone; 2-Methylnaphthoquinone; 3-Methyl-1,4-naphthoquinone; Juva-K; Menaphtone; Menaquinone O; USAF EK-5185; 2-Methyl-1,4-naphthochinon; 2-Methyl-1,4-naftochinon; 2-Methyl-1,4-naphthalendione; NSC 4170; Menaphthene; Kaynone; Vitamin K0

Condensed phase thermochemistry data

Data compiled by: Hussein Y. Afeefy, Joel F. Liebman, and Stephen E. Stein
Quantity | Value | Units | Method | Reference | Comment |
---|---|---|---|---|---|
ΔcH°solid | -5238. ± 4. | kJ/mol | Ccb | Berliner, 1946 | Corresponding ΔfHºsolid = -230. kJ/mol (simple calculation by NIST; no Washburn corrections) |

Phase change data

Data compiled by: Thermodynamics Research Center, NIST Boulder Laboratories, Chris Muzny director
Quantity | Value | Units | Method | Reference | Comment |
---|---|---|---|---|---|
Tfus | 376. | K | N/A | Grady, Hays, et al., 1973 | Uncertainty assigned by TRC = 1. K |

Gas phase ion energetics data

Data compiled as indicated in comments:
LLK - Sharon G. Lias, Rhoda D. Levin, and Sherif A. Kafafi
B - John E. Bartmess
Electron affinity determinations
EA (eV) | Method | Reference | Comment |
---|---|---|---|
1.765 ± 0.061 | IMRE | Heinis, Chowdhury, et al., 1988 | ΔGea(423 K) = -38.5 kcal/mol; ΔSea(estimated) = -4.0 eu; B |
1.752 ± 0.048 | IMRE | Fukuda and McIver, 1985 | ΔGea(355 K) = -39.0 kcal/mol; ΔSea =-4.0, est. from data in Heinis, Chowdhury, et al., 1988; B |
Ionization energy determinations
IE (eV) | Method | Reference | Comment |
---|---|---|---|
9.3 | PE | Redchenko, Freimanis, et al., 1980 | LLK |
9.46 | PE | Redchenko, Freimanis, et al., 1980 | Vertical value; LLK |
9.51 | PE | Dougherty, Younathan, et al., 1978 | Vertical value; LLK |

Lee's RI, non-polar column, temperature ramp

Column type | Active phase | I | Reference | Comment |
---|---|---|---|---|
Capillary | SE-52 | 259.23 | Lee, Vassilaros, et al., 1979 | 12. m/0.3 mm/0.34 μm, He, 2. K/min; Tstart: 50. C; Tend: 250. C |

References

Berliner, 1946
Berliner, E.,
A relation between the oxidation-reduction potentials of quinones and the resonance energies of quinones and of hydroquinoes,
J. Am. Chem. Soc., 1946, 68, 49-51. [all data]
Grady, Hays, et al., 1973
Grady, L.T.; Hays, S.E.; King, R.H.; Klein, H.R.; Mader, W.J.; Wyatt, D.K.; Zimmere, R.O.,
Drug purity profiles,
J. Pharm. Sci., 1973, 62, 459. [all data]
Heinis, Chowdhury, et al., 1988
Heinis, T.; Chowdhury, S.; Scott, S.L.; Kebarle, P.,
Electron Affinities of Benzo-, Naphtho-, and Anthraquinones Determined from Gas-Phase Equilibria Measurements,
J. Am. Chem. Soc., 1988, 110, 2, 400, https://doi.org/10.1021/ja00210a015
. [all data]
Fukuda and McIver, 1985
Fukuda, E.K.; McIver, R.T., Jr.,
Relative electron affinities of substituted benzophenones, nitrobenzenes, and quinones. [Anchored to EA(SO2) from 74CEL/BEN],
J. Am. Chem. Soc., 1985, 107, 2291. [all data]
Redchenko, Freimanis, et al., 1980
Redchenko, V.V.; Freimanis, Y.F.; Dregeris, Y.Y.,
Photoelectron Spectroscopy of 2,3-Disubtituted naphthoquinones,
J. Gen. Chem. USSR, 1980, 50, 1507, In original 1847. [all data]
Dougherty, Younathan, et al., 1978
Dougherty, D.; Younathan, E.S.; Voll, R.; Abdulnur, S.; McGlynn, S.P.,
Photoelectron spectroscopy of some biological molecules,
J. Electron Spectrosc. Relat. Phenom., 1978, 13, 379. [all data]
Lee, Vassilaros, et al., 1979
Lee, M.L.; Vassilaros, D.L.; White, C.M.; Novotny, M.,
Retention Indices for Programmed-Temperature Capillary-Column Gas Chromatography of Polycyclic Aromatic Hydrocarbons,
Anal. Chem., 1979, 51, 6, 768-773, https://doi.org/10.1021/ac50042a043
. [all data]