Ethanone, 2-hydroxy-1-phenyl-
- Formula: C8H8O2
- Molecular weight: 136.1479
- IUPAC Standard InChIKey: ZWVHTXAYIKBMEE-UHFFFAOYSA-N
- CAS Registry Number: 582-24-1
- Chemical structure:
View 3d structure (requires JavaScript / HTML 5) - Other names: Acetophenone, 2-hydroxy-; α-Hydroxyacetophenone; ω-Hydroxyacetophenone; Benzoylcarbinol; Glycolophenone; Methanol, benzoyl-; Phenacyl alcohol; 2-Hydroxyacetophenone; Hydroxymethyl phenyl ketone; alpha-Hydroxyacetophenone; Acetophenone, α-hydroxy-; (Hydroxyacetyl)benzene; NSC 171232; 2-Hydroxy-1-phenylethanone; 2-Hydroxy-phenylethanone; Acetophenone, alpha-hydroxy-; 2-hydroxy-1-phenylethan-1-one

Gas phase ion energetics data

Data compiled by: Henry M. Rosenstock, Keith Draxl, Bruce W. Steiner, and John T. Herron
Ionization energy determinations
IE (eV) | Method | Reference |
---|---|---|
9.33 ± 0.05 | EI | Pignataro, Foffani, et al., 1966 |

Van Den Dool and Kratz RI, polar column, temperature ramp

Column type | Active phase | I | Reference | Comment |
---|---|---|---|---|
Capillary | OV-351 | 1762. | Bonvehí, 2005 | 50. m/0.32 mm/0.2 μm, He, 5. K/min; Tstart: 60. C; Tend: 220. C |
Capillary | CP-WAX 57CB | 1771. | Baltes and Mevissen, 1988 | He, 50. C @ 5. min, 2. K/min; Column length: 50. m; Column diameter: 0.24 mm; Tend: 210. C |

References

Pignataro, Foffani, et al., 1966
Pignataro, S.; Foffani, A.; Innorta, G.; Distefano, G.,
Molecular structural effects on the ionization potentials for metasubstituted aromatic compounds and for compounds of the type X-CH2-R,
Z. Physik. Chem. (Frankfurt), 1966, 49, 291. [all data]
Shizuka, Morita, et al., 1969
Shizuka, H.; Morita, T.; Mori, Y.; Tanaka, I.,
The photochemical rearrangement of phenyl acetate,
Bull. Chem. Soc. Jpn., 1969, 42, 1831-1836. [all data]
Bonvehí, 2005
Bonvehí, J.S.,
Investigation of aromatic compounds in roasted cocoa powder,
Eur. Food Res. Technol., 2005, 221, 1-2, 19-29, https://doi.org/10.1007/s00217-005-1147-y
. [all data]
Baltes and Mevissen, 1988
Baltes, W.; Mevissen, L.,
Model reactions on roast aroma formation. VI. Volatile reaction products from the reaction of phenylalanine with glucose during cooking and roasting,
Z. Lebensm. Unters. Forsch., 1988, 187, 3, 209-214, https://doi.org/10.1007/BF01043341
. [all data]