Argon, compound with xenon (1:1)
- Formula: ArXe
- Molecular weight: 171.241
- IUPAC Standard InChIKey: DGJPLFUDZQEBFH-UHFFFAOYSA-N
- CAS Registry Number: 58206-67-0
- Chemical structure:
View 3d structure (requires JavaScript / HTML 5) - Permanent link for this species. Use this link for bookmarking this species for future reference.

Gas phase ion energetics data

Data compiled as indicated in comments:
LBLHLM - Sharon G. Lias, John E. Bartmess, Joel F. Liebman, John L. Holmes, Rhoda D. Levin, and W. Gary Mallard
LLK - Sharon G. Lias, Rhoda D. Levin, and Sherif A. Kafafi
Ionization energy determinations
IE (eV) | Method | Reference | Comment |
---|---|---|---|
11.968 ± 0.012 | PI | Dehmer and Pratt, 1982 | T = 0K; LBLHLM |
11.985 ± 0.017 | PI | Ng, Tiedemann, et al., 1977 | LLK |

References

Dehmer and Pratt, 1982
Dehmer, P.M.; Pratt, S.T.,
Photoionization of ArKr, ArXe, and KrXe and bond dissociation energies of the rare gas dimer ions,
J. Chem. Phys., 1982, 77, 4804. [all data]
Ng, Tiedemann, et al., 1977
Ng, C.Y.; Tiedemann, P.W.; Mahan, B.H.; Lee, Y.T.,
Photoionization studies of the diatomic heteronuclear rare gas molecules XeKr, XeAr, and KrAr,
J. Chem. Phys., 1977, 66, 5737. [all data]