2-Naphthaleneacetic acid
- Formula: C12H10O2
- Molecular weight: 186.2066
- IUPAC Standard InChIKey: VIBOGIYPPWLDTI-UHFFFAOYSA-N
- CAS Registry Number: 581-96-4
- Chemical structure:
View 3d structure (requires JavaScript / HTML 5) - Other names: β-Naphthaleneacetic acid; 2-(2-Naphthyl)acetic acid; 2-Naphthylacetic acid; β-Naphthylacetic acid; Betoxan; Acide β-naphthylacetique

Condensed phase thermochemistry data

Data compiled by: Hussein Y. Afeefy, Joel F. Liebman, and Stephen E. Stein
Quantity | Value | Units | Method | Reference | Comment |
---|---|---|---|---|---|
ΔfH°solid | -371.95 ± 0.99 | kJ/mol | Ccb | Colomina, Roux, et al., 1975 | |
Quantity | Value | Units | Method | Reference | Comment |
ΔcH°solid | -5779.34 ± 0.99 | kJ/mol | Ccb | Colomina, Roux, et al., 1975 | Corresponding ΔfHºsolid = -371.93 kJ/mol (simple calculation by NIST; no Washburn corrections) |

Phase change data

Data compiled by: William E. Acree, Jr., James S. Chickos
Quantity | Value | Units | Method | Reference | Comment |
---|---|---|---|---|---|
ΔsubH° | 124.6 ± 1.0 | kJ/mol | GS | Roux *, Temprado, et al., 2004 | Based on data from 343. to 372. K. |

Gas phase ion energetics data

Data compiled as indicated in comments:
LBLHLM - Sharon G. Lias, John E. Bartmess, Joel F. Liebman, John L. Holmes, Rhoda D. Levin, and W. Gary Mallard
Ionization energy determinations
IE (eV) | Method | Reference | Comment |
---|---|---|---|
8.05 | PE | Klasinc, Kovac, et al., 1983 | LBLHLM |

References

Colomina, Roux, et al., 1975
Colomina, M.; Roux, M.V.; Turrion, C.,
Thermochemical properties of naphthalene compounds III. Enthalpies of combustion and formation of the 1- and 2-naphthylacetic acids and 1- and 2-naphthyl acetates,
J. Chem. Thermodyn., 1975, 7, 759-762. [all data]
Roux *, Temprado, et al., 2004
Roux *, Maria Victoria; Temprado, Manuel; Notario, Rafael; Verevkin, Sergey P.; Emel'yanenko, Vladimir N.; Demasters, Douglas E.; Liebman, Joel F.,
The energetics of naphthalene derivatives, III: phenylacetic acid and the isomeric 1- and 2-naphthylacetic acids,
Molecular Physics, 2004, 102, 18, 1909-1917, https://doi.org/10.1080/00268970412331284262
. [all data]
Klasinc, Kovac, et al., 1983
Klasinc, L.; Kovac, B.; Gusten, H.,
Photoelectron spectra of acenes. Electronic structure and substituent effects,
Pure Appl. Chem., 1983, 55, 289. [all data]