CF3Cl-

Vibrational and/or electronic energy levels

Data compiled by: Marilyn E. Jacox

State:   X

Vib.
sym.
 No.   Approximate
 type of mode
 cm-1   Med.   Method   References

938 s Ar IR Prochaska and Andrews, 1978
Prochaska and Andrews, 1978, 2
933 s Ar IR Prochaska and Andrews, 1978
Prochaska and Andrews, 1978, 2
666 m Ar IR Prochaska and Andrews, 1978
Prochaska and Andrews, 1978, 2

Additional references: Jacox, 1994, page 303

References

Prochaska and Andrews, 1978
Prochaska, F.T.; Andrews, L., Matrix photoionization studies of trifluoromethyl halide systems. Infrared spectra of the CF3+, CF2X+, and CF3X+ cations in solid argon, J. Am. Chem. Soc., 1978, 100, 7, 2102, https://doi.org/10.1021/ja00475a021 . [all data]

Prochaska and Andrews, 1978, 2
Prochaska, F.T.; Andrews, L., Matrix radiolysis and photoionization of CF2Cl2 and CF3Cl. Infrared spectra of CF2Cl+ and the parent cations, J. Chem. Phys., 1978, 68, 12, 5577, https://doi.org/10.1063/1.435687 . [all data]

Jacox, 1994
Jacox, M.E., Vibrational and electronic energy levels of polyatomic transient molecules, American Chemical Society, Washington, DC, 1994, 464. [all data]