Naphthalene, 2,3-dimethyl-
- Formula: C12H12
- Molecular weight: 156.2237
- IUPAC Standard InChIKey: WWGUMAYGTYQSGA-UHFFFAOYSA-N
- CAS Registry Number: 581-40-8
- Chemical structure:
View 3d structure (requires JavaScript / HTML 5) - Other names: Guajen; 2,3-Dimethylnaphthalene

Gas phase thermochemistry data

Data compiled as indicated in comments:
ALS - Hussein Y. Afeefy, Joel F. Liebman, and Stephen E. Stein
DRB - Donald R. Burgess, Jr.
GT - Glushko Thermocenter, Russian Academy of Sciences, Moscow
Quantity | Value | Units | Method | Reference | Comment |
---|---|---|---|---|---|
ΔfH°gas | 18.2 ± 0.48 | kcal/mol | Ccb | Colomina, Jimenez, et al., 1979 | ALS |
ΔfH°gas | 19.1 | kcal/mol | N/A | Good, 1973 | Value computed using ΔfHsolid° value of -2.3±1.1 kj/mol from Good, 1973 and ΔsubH° value of 82.2 kj/mol from Colomina, Jimenez, et al., 1979.; DRB |
Constant pressure heat capacity of gas
Cp,gas (cal/mol*K) | Temperature (K) | Reference | Comment |
---|---|---|---|
10.1 | 50. | Thermodynamics Research Center, 1997 | p=1 bar. Among all statistically calculated values of S(T) for methyl- and dimethylnaphthalenes [ Thermodynamics Research Center, 1997], only for 2,3-dimethylnaphthalene calculated values are substantially different from experimental ones.; GT |
17.4 | 100. | ||
24.31 | 150. | ||
31.17 | 200. | ||
41.42 | 273.15 | ||
44.93 | 298.15 | ||
45.20 | 300. | ||
58.53 | 400. | ||
69.98 | 500. | ||
79.40 | 600. | ||
87.14 | 700. | ||
93.55 | 800. | ||
98.95 | 900. | ||
103.5 | 1000. | ||
107. | 1100. | ||
111. | 1200. | ||
114. | 1300. | ||
116. | 1400. | ||
118. | 1500. |

Condensed phase thermochemistry data

Data compiled as indicated in comments:
ALS - Hussein Y. Afeefy, Joel F. Liebman, and Stephen E. Stein
DH - Eugene S. Domalski and Elizabeth D. Hearing
Quantity | Value | Units | Method | Reference | Comment |
---|---|---|---|---|---|
ΔfH°solid | -1.45 ± 0.46 | kcal/mol | Ccb | Colomina, Jimenez, et al., 1979 | ALS |
ΔfH°solid | -0.56 ± 0.26 | kcal/mol | Ccb | Good, 1973 | crystal phase; ALS |
Quantity | Value | Units | Method | Reference | Comment |
ΔcH°solid | -1537.05 ± 0.26 | kcal/mol | Ccb | Colomina, Jimenez, et al., 1979 | Corresponding ΔfHºsolid = -1.46 kcal/mol (simple calculation by NIST; no Washburn corrections); ALS |
ΔcH°solid | -1537.95 ± 0.21 | kcal/mol | Ccb | Good, 1973 | crystal phase; Corresponding ΔfHºsolid = -0.55 kcal/mol (simple calculation by NIST; no Washburn corrections); ALS |
Quantity | Value | Units | Method | Reference | Comment |
S°solid,1 bar | 53.9802 | cal/mol*K | N/A | Messerly, Finke, et al., 1988 | crystaline, I phase; DH |
Constant pressure heat capacity of solid
Cp,solid (cal/mol*K) | Temperature (K) | Reference | Comment |
---|---|---|---|
51.4 | 298. | Sciesinski, Godlewska, et al., 1989 | T = 100 to 350 K. Cp value estimated from graph.; DH |
51.7366 | 298.15 | Messerly, Finke, et al., 1988 | crystaline, I phase; T = 10 to 400 K.; DH |

Phase change data

Data compiled as indicated in comments:
TRC - Thermodynamics Research Center, NIST Boulder Laboratories, Chris Muzny director
AC - William E. Acree, Jr., James S. Chickos
ALS - Hussein Y. Afeefy, Joel F. Liebman, and Stephen E. Stein
DRB - Donald R. Burgess, Jr.
DH - Eugene S. Domalski and Elizabeth D. Hearing
Quantity | Value | Units | Method | Reference | Comment |
---|---|---|---|---|---|
Tboil | 541.15 | K | N/A | Cooper, Crowne, et al., 1967 | Uncertainty assigned by TRC = 0.6 K; TRC |
Tboil | 542.4 | K | N/A | Kruber and Oberkobusch, 1951 | Uncertainty assigned by TRC = 1.5 K; TRC |
Tboil | 541. | K | N/A | Bailey, Bryant, et al., 1947 | Uncertainty assigned by TRC = 5. K; TRC |
Quantity | Value | Units | Method | Reference | Comment |
Tfus | 378. | K | N/A | Kotula and Rabczuk, 1985 | Uncertainty assigned by TRC = 2. K; TRC |
Tfus | 378.4 | K | N/A | Smith, 1980 | Uncertainty assigned by TRC = 0.3 K; TRC |
Tfus | 376.15 | K | N/A | Luther and Riechel, 1950 | Uncertainty assigned by TRC = 0.6 K; TRC |
Quantity | Value | Units | Method | Reference | Comment |
Ttriple | 377.490 | K | N/A | Messerly, Finke, et al., 1988, 2 | Crystal phase 1 phase; Uncertainty assigned by TRC = 0.01 K; TRC |
Quantity | Value | Units | Method | Reference | Comment |
ΔsubH° | 19.6 ± 0.1 | kcal/mol | V | Colomina, Jimenez, et al., 1979 | ALS |
ΔsubH° | 19.6 | kcal/mol | N/A | Colomina, Jimenez, et al., 1979 | DRB |
Enthalpy of vaporization
ΔvapH (kcal/mol) | Temperature (K) | Method | Reference | Comment |
---|---|---|---|---|
14.6 ± 0.2 | 380. | N/A | Messerly, Finke, et al., 1988 | AC |
14.3 | 393. | A | Stephenson and Malanowski, 1987 | Based on data from 378. to 408. K.; AC |
Antoine Equation Parameters
log10(P) = A − (B / (T + C))
P = vapor pressure (atm)
T = temperature (K)
View plot Requires a JavaScript / HTML 5 canvas capable browser.
Temperature (K) | A | B | C | Reference | Comment |
---|---|---|---|---|---|
378. to 408. | 3.76230 | 1657.142 | -106.824 | Osborn and Douslin, 1975 | Coefficents calculated by NIST from author's data. |
Enthalpy of sublimation
ΔsubH (kcal/mol) | Temperature (K) | Method | Reference | Comment |
---|---|---|---|---|
14.60 ± 0.024 | 377.7 | V | Messerly, Finke, et al., 1988, 2 | ALS |
19.8 | 348. | A | Stephenson and Malanowski, 1987 | Based on data from 333. to 373. K.; AC |
19.6 ± 0.1 | 294. | ME | Colomina, Jimenez, et al., 1979, 2 | Based on data from 287. to 300. K.; AC |
19.09 ± 0.07 | 378.3 | V | Aihara, 1959 | crystal phase; ALS |
19.1 ± 0.1 | 290. | V | Aihara, 1959, 2 | Based on data from 278. to 301. K. See also Stephenson and Malanowski, 1987.; AC |
Enthalpy of fusion
ΔfusH (kcal/mol) | Temperature (K) | Method | Reference | Comment |
---|---|---|---|---|
5.729 | 377.2 | DSC | Cheon and Kim, 2007 | AC |
3.80 | 378. | N/A | Acree, 1991 | AC |
Temperature of phase transition
Ttrs (K) | Initial Phase | Final Phase | Reference | Comment |
---|---|---|---|---|
220. | crystaline, IV | crystaline, III | Sciesinski, Godlewska, et al., 1989 | DH |
275. | crystaline, III | crystaline, II | Sciesinski, Godlewska, et al., 1989 | DH |
Enthalpy of phase transition
ΔHtrs (kcal/mol) | Temperature (K) | Initial Phase | Final Phase | Reference | Comment |
---|---|---|---|---|---|
-0.00014 | 226.000 | crystaline, III | crystaline, II | Messerly, Finke, et al., 1988 | DH |
-0.000259 | 265.000 | crystaline, II | crystaline, I | Messerly, Finke, et al., 1988 | DH |
4.625548 | 377.496 | crystaline, I | liquid | Messerly, Finke, et al., 1988 | DH |
0.0249 | 302. | crystaline, II | crystaline, I | Sciesinski, Godlewska, et al., 1989 | DH |
Entropy of phase transition
ΔStrs (cal/mol*K) | Temperature (K) | Initial Phase | Final Phase | Reference | Comment |
---|---|---|---|---|---|
12.25 | 377.496 | crystaline, I | liquid | Messerly, Finke, et al., 1988 | DH |
0.084 | 302. | crystaline, II | crystaline, I | Sciesinski, Godlewska, et al., 1989 | DH |

Gas phase ion energetics data

Data compiled as indicated in comments:
LLK - Sharon G. Lias, Rhoda D. Levin, and Sherif A. Kafafi
RDSH - Henry M. Rosenstock, Keith Draxl, Bruce W. Steiner, and John T. Herron
B - John E. Bartmess
Electron affinity determinations
EA (eV) | Method | Reference | Comment |
---|---|---|---|
<0.17 ± 0.13 | ECD | Wojnarovits and Foldiak, 1981 | EA is an upper limit: Chen and Wentworth, 1989. G3MP2B3 calculations indicate an EA of ca. -0.2 eV, anion unbound.; B |
Ionization energy determinations
IE (eV) | Method | Reference | Comment |
---|---|---|---|
8.11 | CTS | Slifkin and Allison, 1967 | RDSH |
8.20 ± 0.05 | EI | Nounou, 1966 | RDSH |
7.89 ± 0.03 | PE | Heilbronner, Hoshi, et al., 1976 | Vertical value; LLK |

Kovats' RI, non-polar column, isothermal

Column type | Active phase | Temperature (C) | I | Reference | Comment |
---|---|---|---|---|---|
Capillary | Squalane | 120. | 1408.2 | Gerasimenko and Nabivach, 1997 | Column length: 50. m |
Capillary | OV-1 | 150. | 1433. | Zhang, Chen, et al., 1997 | 25. m/0.2 mm/0.33 μm, N2 |
Capillary | OV-1 | 150. | 1433. | Zhang, Chen, et al., 1997 | 25. m/0.2 mm/0.33 μm, N2 |
Capillary | OV-1 | 150. | 1434. | Zhang, Chen, et al., 1997 | 25. m/0.2 mm/0.33 μm, N2 |
Capillary | CP Sil 8 CB | 130. | 1442.3 | Schaefer and Höltkemeier, 1992 | 50. m/0.32 mm/0.25 μm |
Capillary | SE-30 | 100. | 1395. | Bredael, 1982 | Column length: 100. m; Column diameter: 0.5 mm |
Capillary | SE-30 | 130. | 1419. | Bredael, 1982 | Column length: 100. m; Column diameter: 0.5 mm |
Capillary | SE-30 | 150. | 1433. | Bredael, 1982 | Column length: 100. m; Column diameter: 0.5 mm |
Capillary | OV-101 | 140. | 1427.3 | Gerasimenko, Kirilenko, et al., 1981 | N2; Column length: 50. m; Column diameter: 0.3 mm |
Capillary | OV-101 | 160. | 1441.7 | Gerasimenko, Kirilenko, et al., 1981 | N2; Column length: 50. m; Column diameter: 0.3 mm |
Capillary | OV-1 | 130. | 1420. | Engewald, Wennrich, et al., 1979 | Column length: 50. m; Column diameter: 0.23 mm |
Capillary | Squalane | 130. | 1399. | Bogoslovsky, Anvaer, et al., 1978 | |
Packed | SE-30 | 150. | 1438. | Shlyakhov, Anvaer, et al., 1975 |

Kovats' RI, non-polar column, temperature ramp

Column type | Active phase | I | Reference | Comment |
---|---|---|---|---|
Capillary | OV-101 | 1410. | Hayes and Pitzer, 1982 | 110. m/0.25 mm/0.20 μm, He, 1. K/min; Tstart: 35. C; Tend: 200. C |

Van Den Dool and Kratz RI, non-polar column, temperature ramp

Column type | Active phase | I | Reference | Comment |
---|---|---|---|---|
Capillary | DB-5 | 1446. | Rostad and Pereira, 1986 | 30. m/0.26 mm/0.25 μm, He, 50. C @ 4. min, 6. K/min, 300. C @ 20. min |
Capillary | OV-101 | 1410. | Hayes and Pitzer, 1981 | 108. m/0.25 mm/0.2 μm, 1. K/min; Tstart: 35. C; Tend: 200. C |

Van Den Dool and Kratz RI, non-polar column, custom temperature program

Column type | Active phase | I | Reference | Comment |
---|---|---|---|---|
Capillary | HP-5 | 1435. | Sandercock and du Pasquier, 2003 | 30. m/0.25 mm/0.25 μm, He; Program: 40C(3min) => 4C/min => 208C => 25C/min => 290C(5min) |
Capillary | DB-5 | 1438. | Havenga and Rohwer, 1999 | 30. m/0.25 mm/0.25 μm, He; Program: 60 0C 7 0C/min -> 130 0C 5 0C/min -> 200 0C 6 0C/min -> 260 0C 20 0C/min -> 320 0C (4 min) |

Van Den Dool and Kratz RI, polar column, temperature ramp

Column type | Active phase | I | Reference | Comment |
---|---|---|---|---|
Capillary | Supelcowax-10 | 2008. | Chung, Yung, et al., 2002 | 60. m/0.25 mm/0.25 μm, He, 35. C @ 5. min, 2. K/min, 195. C @ 90. min |
Capillary | Supelcowax-10 | 2008. | Chung, Yung, et al., 2001 | 60. m/0.25 mm/0.25 μm, He, 35. C @ 5. min, 2. K/min, 195. C @ 90. min |
Capillary | Supelcowax-10 | 2009. | Chung, 1999 | 60. m/0.25 mm/0.25 μm, He, 35. C @ 5. min, 2. K/min, 195. C @ 90. min |

Normal alkane RI, non-polar column, isothermal

Column type | Active phase | Temperature (C) | I | Reference | Comment |
---|---|---|---|---|---|
Capillary | OV-101 | 120. | 1427. | Nabivach and Gerasimenko, 1996 | |
Capillary | Squalane | 120. | 1400. | Nabivach and Gerasimenko, 1996 | |
Capillary | Squalane | 120. | 1408. | Nabivach and Gerasimenko, 1996 | |
Capillary | Squalane | 130. | 1400. | Papazova and Pankova, 1975 | N2; Column length: 100. m; Column diameter: 0.25 mm |
Packed | Polydimethyl siloxane | 147. | 1430. | Ferrand, 1962 |

Normal alkane RI, non-polar column, temperature ramp

Column type | Active phase | I | Reference | Comment |
---|---|---|---|---|
Capillary | HP-5 MS | 1444. | Radulovic, Blagojevic, et al., 2010 | 30. m/0.25 mm/0.25 μm, Helium, 5. K/min, 290. C @ 10. min; Tstart: 70. C |
Capillary | HP-5 MS | 1443. | Radulovic, Dordevic, et al., 2010 | 30. m/0.25 mm/0.25 μm, Helium, 5. K/min, 290. C @ 10. min; Tstart: 70. C |
Capillary | Ultra-1 | 1418. | Elizalde-González, Hutfliess, et al., 1996 | 50. m/0.2 mm/0.33 μm, H2, 3. K/min, 300. C @ 35. min; Tstart: 60. C |

Normal alkane RI, non-polar column, custom temperature program

Column type | Active phase | I | Reference | Comment |
---|---|---|---|---|
Capillary | CP Sil 8 CB | 1442. | Bertsch, 1999 | Program: not specified |
Capillary | OV-1 | 1419.6 | Dimov, Osman, et al., 1994 | Program: not specified |
Capillary | Polydimethyl siloxane, unknown content of Ph-groups | 1446. | Geldon, 1989 | Program: not specified |
Capillary | Polydimethyl siloxane, unknown content of Ph-groups | 1447. | Geldon, 1989 | Program: not specified |
Capillary | OV-1, SE-30, Methyl silicone, SP-2100, OV-101, DB-1, etc. | 1420. | Waggott and Davies, 1984 | Hydrogen; Column length: 50. m; Column diameter: 0.32 mm; Program: not specified |

Lee's RI, non-polar column, temperature ramp

Column type | Active phase | I | Reference | Comment |
---|---|---|---|---|
Capillary | DB-5MS | 246.51 | Sun, Zhou, et al., 2008 | 30. m/0.25 mm/0.25 μm, 50. C @ 2. min, 6. K/min, 300. C @ 16. min |
Capillary | 5 % Phenyl methyl siloxane | 243.55 | Skrbic and Onjia, 2006 | 2. K/min; Tstart: 50. C; Tend: 250. C |
Capillary | DB-5MS | 247.04 | Chen, Keeran, et al., 2002 | 30. m/0.25 mm/0.5 μm, 40. C @ 1. min, 10. K/min; Tend: 310. C |
Capillary | HP-5 | 246.42 | Piao, Chu, et al., 1999 | 30. m/0.25 mm/0.25 μm, 50. C @ 2. min, 4. K/min, 280. C @ 20. min |
Capillary | DB-5 | 245.70 | Williams and Horne, 1995 | He, 60. C @ 2. min, 5. K/min; Column length: 25. m; Column diameter: 0.3 mm; Tend: 270. C |
Capillary | DB-5 | 246.73 | Wang, Fingas, et al., 1994 | 30. m/0.32 mm/0.25 μm, He, 50. C @ 2. min, 6. K/min; Tend: 300. C |
Capillary | CP Sil 8 CB | 246.2 | Bundt, Herbel, et al., 1991 | 50. m/0.25 mm/0.25 μm, He, 4. K/min; Tstart: 80. C; Tend: 300. C |
Capillary | SE-54 | 246.29 | Guillén, Blanco, et al., 1989 | 20. m/0.22 mm/0.20 μm, He, 4. K/min; Tstart: 50. C; Tend: 300. C |
Capillary | DB-5 | 247.04 | Rostad and Pereira, 1986 | 30. m/0.26 mm/0.25 μm, He, 50. C @ 4. min, 6. K/min, 300. C @ 20. min |
Capillary | DB-5 | 239.0 | Viau, Studak, et al., 1984 | Helium, 4. K/min; Column length: 30. m; Column diameter: 0.32 mm; Tstart: 90. C; Tend: 250. C |
Capillary | SE-52 | 246.03 | Vassilaros, Kong, et al., 1982 | 20. m/0.30 mm/0.25 μm, H2, 40. C @ 2. min, 4. K/min; Tend: 265. C |
Capillary | SE-52 | 243.55 | Lee, Vassilaros, et al., 1979 | 12. m/0.3 mm/0.34 μm, He, 2. K/min; Tstart: 50. C; Tend: 250. C |

Lee's RI, non-polar column, custom temperature program

Column type | Active phase | I | Reference | Comment |
---|---|---|---|---|
Capillary | DB-5 | 244.5 | Fuentes, Font, et al., 2007 | Column length: 60. m; Program: not specified |
Capillary | DB-5MS | 246.5 | Aracil, Font, et al., 2005 | Column length: 60. m; Column diameter: 0.25 mm; Program: not specified |
Capillary | Ultra-1 | 243.6 | Sremac, Skrbic, et al., 2005 | 50. m/0.32 mm/0.50 μm, Nitrogen; Program: 40-100 0C 3-15 0C/min -> 290 0C |
Capillary | HP-5 | 247.02 | Sandercock and du Pasquier, 2003 | 30. m/0.25 mm/0.25 μm, He; Program: 40C(3min) => 4C/min => 208C => 25C/min => 290C(5min) |
Capillary | CP Sil 8 CB | 246.3 | Bundt, Herbel, et al., 1991 | 50. m/0.25 mm/0.25 μm, He; Program: not specified |
Capillary | DB-5 | 242.64 | Naikwadi, Charbonneau, et al., 1987 | Column length: 30. m; Column diameter: 0.32 mm; Program: not specified |
Capillary | DB-5 | 243.55 | Naikwadi, Charbonneau, et al., 1987 | Column length: 30. m; Column diameter: 0.32 mm; Program: not specified |

References

Colomina, Jimenez, et al., 1979
Colomina, M.; Jimenez, P.; Roux, M.V.; Turrion, C.,
Thermochemical properties of naphthalene derivatives. V. Formation enthalpies of 2,3-dimethylnaphthalene and 2,3-dihydroxynaphthalene,
An. Quim., 1979, 75, 620-624. [all data]
Good, 1973
Good, W.D.,
The enthalpies of combustion and formation of 1,8-dimethylnaphthalene, 2,3-dimethylnaphthalene, 2,6-dimethylnaphthalene, and 2,7-dimethylnaphthalene,
J. Chem. Thermodyn., 1973, 5, 715-720. [all data]
Thermodynamics Research Center, 1997
Thermodynamics Research Center,
Selected Values of Properties of Chemical Compounds., Thermodynamics Research Center, Texas A&M University, College Station, Texas, 1997. [all data]
Messerly, Finke, et al., 1988
Messerly, J.F.; Finke, H.L.; Good, W.D.; Gammon, B.E.,
Condensed-phase heat capacities and derived thermodynamic properties for 1,4-dimethylbenzene, 1,2-diphenylethane, and 2,3-dimethylnaphthalene,
J. Chem. Thermodynam., 1988, 20, 485-501. [all data]
Sciesinski, Godlewska, et al., 1989
Sciesinski, J.; Godlewska, M.; Witko, W.,
An adiabatic calrimetry study of the polymorphism of 2,3-dimethylnaphthalene,
J. Phys.: Condens. Matter, 1989, 1(22), 3545-3550. [all data]
Cooper, Crowne, et al., 1967
Cooper, A.R.; Crowne, C.W.P.; Farrell, P.G.,
Gas-Liquid Chromatographic Studies of Electron-Donor-Acceptor Systems,
Trans. Faraday Soc., 1967, 63, 447. [all data]
Kruber and Oberkobusch, 1951
Kruber, O.; Oberkobusch, R.,
Chem. Ber., 1951, 84, 826. [all data]
Bailey, Bryant, et al., 1947
Bailey; Bryant; Hancock; Morrell; Smith, J.O.,
The ten dimethylnaphthalenes, their physical properties, molecular compounds, and ultra-violet spectra,
J. Inst. Pet., 1947, 33, 503. [all data]
Kotula and Rabczuk, 1985
Kotula, I.; Rabczuk, A.,
DTA Investigation of the Solid-Liquid Equilibrium for Mehtyl Derivatives of Naphthalene with Some Nitroaromatics,
J. Therm. Anal., 1985, 30, 195. [all data]
Smith, 1980
Smith, G.W.,
Phase behavior of some condensed polycyclic aromatics,
Mol. Cryst. Liq. Cryst., 1980, 64, 15. [all data]
Luther and Riechel, 1950
Luther, H.; Riechel, C.,
The Raman Spectra of Polymethylnphthalenes,
Z. Phys. Chem. (Leipzig), 1950, 195, 103. [all data]
Messerly, Finke, et al., 1988, 2
Messerly, J.F.; Finke, H.L.; Good, W.D.; Gammon, B.E.,
Condensed-phase heat capacities and derived thermodynamic properties for 1,4-dimethylbenzene, 1,2-diphenylethane, and 2,3-dimethylnaphthalene,
J. Chem. Thermodyn., 1988, 20, 485. [all data]
Stephenson and Malanowski, 1987
Stephenson, Richard M.; Malanowski, Stanislaw,
Handbook of the Thermodynamics of Organic Compounds, 1987, https://doi.org/10.1007/978-94-009-3173-2
. [all data]
Osborn and Douslin, 1975
Osborn, Ann G.; Douslin, Donald R.,
Vapor pressures and derived enthalpies of vaporization for some condensed-ring hydrocarbons,
J. Chem. Eng. Data, 1975, 20, 3, 229-231, https://doi.org/10.1021/je60066a022
. [all data]
Colomina, Jimenez, et al., 1979, 2
Colomina, M.; Jimenez, P.; Roux, M.V.; Turrion, C.,
An. Quim., 1979, 75, 620. [all data]
Aihara, 1959
Aihara, A.,
Estimation of the energy of hydrogen bonds formed in crystals. I. Sublimation pressures of some organic molecular crystals and the additivity of lattice energy,
Bull. Chem. Soc. Jpn., 1959, 32, 1242. [all data]
Aihara, 1959, 2
Aihara, Ariyuki,
Estimation of the Energy of Hydrogen Bonds Formed in Crystals. I. Sublimation Pressures of Some Organic Molecular Crystals and the Additivity of Lattice Energy,
Bull. Chem. Soc. Jpn., 1959, 32, 11, 1242-1248, https://doi.org/10.1246/bcsj.32.1242
. [all data]
Cheon and Kim, 2007
Cheon, Yang-Ho; Kim, Kwang-Joo,
Solid-Liquid Equilibria of Binary Mixtures of Dimethylnaphthalene Isomers,
J. Chem. Eng. Data, 2007, 52, 4, 1390-1393, https://doi.org/10.1021/je700088n
. [all data]
Acree, 1991
Acree, William E.,
Thermodynamic properties of organic compounds: enthalpy of fusion and melting point temperature compilation,
Thermochimica Acta, 1991, 189, 1, 37-56, https://doi.org/10.1016/0040-6031(91)87098-H
. [all data]
Wojnarovits and Foldiak, 1981
Wojnarovits, L.; Foldiak, G.,
Electron capture detection of aromatic hydrocarbons,
J. Chromatogr. Sci., 1981, 206, 511. [all data]
Chen and Wentworth, 1989
Chen, E.C.M.; Wentworth, W.E.,
Experimental Determination of Electron Affinities of Organic Molecules,
Mol. Cryst. Liq. Cryst., 1989, 171, 271. [all data]
Slifkin and Allison, 1967
Slifkin, M.A.; Allison, A.C.,
Measurement of ionization potentials from contact charge transfer spectra,
Nature, 1967, 215, 949. [all data]
Nounou, 1966
Nounou, P.,
Etude des composes aromatiques par spectrometrie de masse. I. Mesure des potentials d'ionisation et d'apparition par la methode du potential retardateur et interpretation des courbes d'ionisation differentielle,
J. Chim. Phys., 1966, 63, 994. [all data]
Heilbronner, Hoshi, et al., 1976
Heilbronner, E.; Hoshi, T.; von Rosenberg, J.L.; Hafner, K.,
Alkyl-induced, natural hypsochromic shifts of the 2A←2X and 2B←2X transitions of azulene and naphthalene radical cations,
Nouv. J. Chim., 1976, 1, 105. [all data]
Gerasimenko and Nabivach, 1997
Gerasimenko, V.A.; Nabivach, V.M.,
Sorption-structure correlations in the series of alkyl derivatives of naphthalene,
J. Anal. Chem. USSR (Engl. Transl.), 1997, 52, 1, 21-27. [all data]
Zhang, Chen, et al., 1997
Zhang, M.; Chen, B.; Shen, S.; Chen, S.,
Compositional studies of high-temperature coal tar by g.c.-FT-i.r. analysis of middle oil fractions,
Fuel, 1997, 76, 5, 415-423, https://doi.org/10.1016/S0016-2361(97)85518-4
. [all data]
Schaefer and Höltkemeier, 1992
Schaefer, R.G.; Höltkemeier, J.,
Direkte Analyse von dimethylnaphthalinen in Erdölen mittels zweidimensionaler Kapillar-Gas-Chromatographie,
Anal. Chim. Acta., 1992, 260, 1, 107-112, https://doi.org/10.1016/0003-2670(92)80133-R
. [all data]
Bredael, 1982
Bredael, P.,
Retention indices of hydrocarbons on SE-30,
J. Hi. Res. Chromatogr. Chromatogr. Comm., 1982, 5, 6, 325-328, https://doi.org/10.1002/jhrc.1240050610
. [all data]
Gerasimenko, Kirilenko, et al., 1981
Gerasimenko, V.A.; Kirilenko, A.V.; Nabivach, V.M.,
Capillary gas chromatography of aromatic compounds found in coal tar fractions,
J. Chromatogr., 1981, 208, 1, 9-16, https://doi.org/10.1016/S0021-9673(00)87953-4
. [all data]
Engewald, Wennrich, et al., 1979
Engewald, W.; Wennrich, L.; Ritter, E.,
Molekülstruktur und Retentionsverhalten. XII. Zur Retention von Alkylnaphthalinen Bei der Gasverteilungs- und Gas-Adsorptions-Chromatographie,
J. Chromatogr., 1979, 174, 2, 315-323, https://doi.org/10.1016/S0021-9673(00)86005-7
. [all data]
Bogoslovsky, Anvaer, et al., 1978
Bogoslovsky, Yu.N.; Anvaer, B.I.; Vigdergauz, M.S.,
Chromatographic constants in gas chromatography (in Russian), Standards Publ. House, Moscow, 1978, 192. [all data]
Shlyakhov, Anvaer, et al., 1975
Shlyakhov, A.F.; Anvaer, B.I.; Zolotareva, O.V.; Romina, N.N.; Novikova, N.V.; Koreshkova, R.I.,
On the possibility of group indentification of hydrocarbons by gas chromatography from temperature coefficients of retention indices,
Zh. Anal. Khim., 1975, 30, 788-792. [all data]
Hayes and Pitzer, 1982
Hayes, P.C., Jr.; Pitzer, E.W.,
Characterizing petroleum- and shale-derived jet fuel distillates via temperature-programmed Kováts indices,
J. Chromatogr., 1982, 253, 179-198, https://doi.org/10.1016/S0021-9673(01)88376-X
. [all data]
Rostad and Pereira, 1986
Rostad, C.E.; Pereira, W.E.,
Kovats and Lee retention indices determined by gas chromatography/mass spectrometry for organic compounds of environmental interest,
J. Hi. Res. Chromatogr. Chromatogr. Comm., 1986, 9, 6, 328-334, https://doi.org/10.1002/jhrc.1240090603
. [all data]
Hayes and Pitzer, 1981
Hayes, P.C., Jr.; Pitzer, E.W.,
Kovats indices as a tool in characterizing hydrocarbon fuels in temperature programmed glass capillary gas chromatography. Part 1. Qualitative identification, Inhouse rpt. for Air Force Wright Aeronautical Labs., Air Force Wright Aeronautical Labs., Wright-Patterson AFB, Ohio, 1981, 75. [all data]
Sandercock and du Pasquier, 2003
Sandercock, P.M.L.; du Pasquier, E.,
Chemical fingerprinting of unevaporated automotive gasoline samples,
Forensic Sci. Int., 2003, 134, 1, 1-10, https://doi.org/10.1016/S0379-0738(03)00081-1
. [all data]
Havenga and Rohwer, 1999
Havenga, W.J.; Rohwer, E.R.,
Chemical Characterization and Screening of Hydrocarbon Pollution in Industrial Soils by Headspace Solid-Phase Microextraction,
J. Chromatogr., 1999, 848, 1-2, 279-295, https://doi.org/10.1016/S0021-9673(99)00522-1
. [all data]
Chung, Yung, et al., 2002
Chung, H.-Y.; Yung, I.K.S.; Ma, W.C.J.; Kim, J.-S.,
Analysis of volatile components in frozen and dried scallops (Patinopecten yessoensis) by gas chromatography/mass spectrometry,
Food Res. Int., 2002, 35, 1, 43-53, https://doi.org/10.1016/S0963-9969(01)00107-7
. [all data]
Chung, Yung, et al., 2001
Chung, H.Y.; Yung, I.K.S.; Kim, J.-S.,
Comparison of volatile components in dried scallops (Chlamys farreri and Patinopecten yessoensis) prepared by boiling and steaming methods,
J. Agric. Food Chem., 2001, 49, 1, 192-202, https://doi.org/10.1021/jf000692a
. [all data]
Chung, 1999
Chung, H.Y.,
Volatile components in crabmeats of Charybdis feriatus,
J. Agric. Food Chem., 1999, 47, 6, 2280-2287, https://doi.org/10.1021/jf981027t
. [all data]
Nabivach and Gerasimenko, 1996
Nabivach, V.M.; Gerasimenko, V.A.,
Gas chromatographic retention characteristics of bicyclic aromatic hydrocarbons,
Coke and Chemistry (Rus), 1996, 6, 27-31. [all data]
Papazova and Pankova, 1975
Papazova, D.I.; Pankova, M.C.,
Identification of individual aromatic hydrocarbons in kerosene fraction (b.p. 150-250 °),
J. Chromatogr., 1975, 105, 2, 411-414, https://doi.org/10.1016/S0021-9673(01)82276-7
. [all data]
Ferrand, 1962
Ferrand, R.,
Gas phase chromatography using retention indices for the analysis of tars and their hydrogenation products,
Journees internationales d'etude des methodes de separation immediate at de chromatographie; Org. sur l'initiative du IX., 1962, 132-140. [all data]
Radulovic, Blagojevic, et al., 2010
Radulovic, N.; Blagojevic, P.; Palic, R.,
Comparative study of the leaf volatiles of Arctostaphylos uva-ursi (L.) Spreng. and Vaccinium vitis-idaea L. (Ericaceae),
Molecules, 2010, 15, 9, 6168-6185, https://doi.org/10.3390/molecules15096168
. [all data]
Radulovic, Dordevic, et al., 2010
Radulovic, N.; Dordevic, N.; Markovic, M.; Palic, R.,
Volatile constituents of Glechoma Hirsuta Waldst. Kit. and G. Hederacea L. (Lamiaceae),
Bull. Chem. Soc. Ethiop., 2010, 24, 1, 67-76, https://doi.org/10.4314/bcse.v24i1.52962
. [all data]
Elizalde-González, Hutfliess, et al., 1996
Elizalde-González, M.P.; Hutfliess, M.; Hedden, K.,
Retention index system, adsorption characteristics, and sructure correlations of polycyclic aromatic hydrocarbons in fuels,
J. Hi. Res. Chromatogr., 1996, 19, 6, 345-352, https://doi.org/10.1002/jhrc.1240190608
. [all data]
Bertsch, 1999
Bertsch, W.,
Two-dimensional gas chromatography. Concepts, instrumentation, and applications. Part 1: Fundamentals, conventional two-dimensional gas chromatography, selected applications,
J. Hi. Res. Chromatogr., 1999, 22, 12, 647-665, https://doi.org/10.1002/(SICI)1521-4168(19991201)22:12<647::AID-JHRC647>3.0.CO;2-V
. [all data]
Dimov, Osman, et al., 1994
Dimov, N.; Osman, A.; Mekenyan, Ov.; Papazova, D.,
Selection of moelcular descriptors used in quantitative structure-gas chromatographic retention relationships. I. Application to alkylbenzenes and naphthalenes,
Anal. Chim. Acta., 1994, 298, 3, 303-317, https://doi.org/10.1016/0003-2670(94)00280-0
. [all data]
Geldon, 1989
Geldon, A.L.,
Ground Water Hydrology of the Central Raton Basin, Colorado and New Mexico, US Geological Survey, US Government Printing Office, 1989, 104. [all data]
Waggott and Davies, 1984
Waggott, A.; Davies, I.W.,
Identification of organic pollutants using linear temperature programmed retention indices (LTPRIs) - Part II, 1984, retrieved from http://dwi.defra.gov.uk/research/completed-research/reports/dwi0383.pdf. [all data]
Sun, Zhou, et al., 2008
Sun, P.; Zhou, Q.; Li, G.; Wang, X.; Zhao, Y.; Cao, L.,
fingerprint analysis of polycyclic aromatic hydrocarbons in crude oil by internal standard method,
J. Instrumental Anal., 2008, 27, 4, 344-348. [all data]
Skrbic and Onjia, 2006
Skrbic, B.; Onjia, A.,
Prediction of Lee Retention Indices of Polycyclic Aromatic Hydrocarbons by Artificial Neural Networks,
J. Chromatorg. A, 2006, 1108, 2, 279-284, https://doi.org/10.1016/j.chroma.2006.01.080
. [all data]
Chen, Keeran, et al., 2002
Chen, P.H.; Keeran, W.S.; Van Ausdale, W.A.; Schindler, D.R.; Roberts, D.W.,
Application of Lee retention indices to the confirmation of tentatively identified compounds from GC/MS analysis of environmental samples, Technical paper, Analytical Services Division, Environmental ScienceEngineering, Inc, PO Box 1703, Gainesville, FL 32602, 2002, 11. [all data]
Piao, Chu, et al., 1999
Piao, M.; Chu, S.; Zheng, M.; Xu, X.,
Characterization of the combustion products of polyethylene,
Chemosphere, 1999, 39, 9, 1497-1512, https://doi.org/10.1016/S0045-6535(99)00054-5
. [all data]
Williams and Horne, 1995
Williams, P.T.; Horne, P.A.,
Analysis of aromatic hydrocarbons in pyrolytic oil derived from biomass,
J. Anal. Appl. Pyrolysis, 1995, 31, 15-37, https://doi.org/10.1016/0165-2370(94)00814-H
. [all data]
Wang, Fingas, et al., 1994
Wang, Z.; Fingas, M.; Li, K.,
Fractionation of a light crude oil and identification and quantitation of aliphatic, aromatic, and biomarker comopunds by GC-FID and GC-MS, Part II,
J. Chromatogr. Sci., 1994, 32, 9, 367-382, https://doi.org/10.1093/chromsci/32.9.367
. [all data]
Bundt, Herbel, et al., 1991
Bundt, J.; Herbel, W.; Steinhart, H.; Franke, S.; Francke, W.,
Structure-type separation of diesel fuels by solid phase extraction and identification of the two- and three-ring aromatics by capillary GC-mass spectrometry,
J. Hi. Res. Chromatogr., 1991, 14, 2, 91-98, https://doi.org/10.1002/jhrc.1240140205
. [all data]
Guillén, Blanco, et al., 1989
Guillén, M.D.; Blanco, J.; Bermejo, J.; Blanco, C.G.,
Temperature programmed retention indices of some PAHs on Capillary columns coated with OV-1701 and SE-54,
J. Hi. Res. Chromatogr., 1989, 12, 8, 552-554, https://doi.org/10.1002/jhrc.1240120816
. [all data]
Viau, Studak, et al., 1984
Viau, A.C.; Studak, S.M.; Karasek, F.W.,
Comparative analysis of hazardous compounds on flu-ash from municipal waste incineration by gas chromatography / mass spectrometry,
Can. J. Chem., 1984, 62, 11, 2140-2145, https://doi.org/10.1139/v84-366
. [all data]
Vassilaros, Kong, et al., 1982
Vassilaros, D.L.; Kong, R.C.; Later, D.W.; Lee, M.L.,
Linear retention index system for polycyclic aromatic compounds. Critical evaluation and additional indices,
J. Chromatogr., 1982, 252, 1-20, https://doi.org/10.1016/S0021-9673(01)88394-1
. [all data]
Lee, Vassilaros, et al., 1979
Lee, M.L.; Vassilaros, D.L.; White, C.M.; Novotny, M.,
Retention Indices for Programmed-Temperature Capillary-Column Gas Chromatography of Polycyclic Aromatic Hydrocarbons,
Anal. Chem., 1979, 51, 6, 768-773, https://doi.org/10.1021/ac50042a043
. [all data]
Fuentes, Font, et al., 2007
Fuentes, M.J.; Font, R.; Gomez-Rico, M.F.; Martin-Gullon, I.,
Pyrolysis and combustion of waste lubricant oil from diesel cars: Decomposition and pollutants,
J. Anal. Appl. Pyrolysis, 2007, 79, 1-2, 215-226, https://doi.org/10.1016/j.jaap.2006.12.004
. [all data]
Aracil, Font, et al., 2005
Aracil, I.; Font, R.; Conesa, J.A.,
Semivolatile and volatile compounds from the pyrolysis and combustion of polyvinyl chloride,
J. Anal. Appl. Pyrolysis, 2005, 74, 1-2, 465-478, https://doi.org/10.1016/j.jaap.2004.09.008
. [all data]
Sremac, Skrbic, et al., 2005
Sremac, S.; Skrbic, B.; Onjia, A.,
Artificial neural network prediction of quantitative structure-retention relationships of polycyclic aromatic hydrocarbons in gas chromatography,
J. Serb. Chem. Soc., 2005, 70, 11, 1291-1300, https://doi.org/10.2298/JSC0511291S
. [all data]
Naikwadi, Charbonneau, et al., 1987
Naikwadi, K.P.; Charbonneau, G.M.; Karasek, F.W.; Clement, R.E.,
Separation and Identification of Organic Compounds in Air Particulate Extracts by High-Performance Liquid Chromatography and Gas Chromatography-Mass Spectrometry,
J. Chromatogr., 1987, 398, 227-237, https://doi.org/10.1016/S0021-9673(01)96508-2
. [all data]